program: Orca
programVersion: 5.0.3
elementType: C H C H C C C H H C H H C C H H H H H H H
charge: 1
multiplicity: 1
keywords: b3lyp def2-TZVP EnGrad D3BJ RIJCOSX verytightscf def2/J soscf
formula: C8H13
InChI: InChI=1/C8H13/c1-2-4-6-8-7-5-3-1/h1-2,7H,3-6,8H2
21 atoms
C  -1.997114 0.754415 0.072806
H  -2.171925 0.84688 1.147729
C  -1.735646 -0.95428 -0.152379
H  -2.618408 -1.319307 0.377315
C  -0.421834 -1.380591 0.39747
C  0.689862 -1.2810 -0.371401
C  2.004123 -0.688629 0.064554
H  2.21494 -0.880635 1.122322
H  2.857322 -1.030772 -0.526582
C  1.79312 0.874029 -0.144146
H  1.843987 1.126567 -1.208657
H  2.599379 1.416535 0.355828
C  0.421889 1.253249 0.474367
C  -0.764999 1.31018 -0.379136
H  0.526249 -1.210658 -1.45141
H  -1.839077 -1.12255 -1.224889
H  0.158024 0.442276 1.174194
H  -0.651587 1.513781 -1.447665
H  -2.878153 0.985088 -0.525108
H  0.430224 2.098259 1.185317
H  -0.342029 -1.50002 1.478379
totalener: -312.20167236 hartree
nucrepener: 379.92716152 hartree
electener: -692.12883388 hartree
oneelecener: -1160.88769373 hartree
twoeener: 468.75885985 hartree
kineticenergy: 310.52400167 hartree
exchangeener: -36.315823755815 hartree
correlationener: -2.304242909346 hartree
xcener: -38.620066665161 hartree
chargesum: 1.0000000
charge: -0.225260 0.184651 -0.215097 0.185751 -0.163595 -0.062829 -0.210661 0.148615 0.156555 -0.261498 0.148979 0.159618 -0.110624 0.074877 0.129647 0.177359 0.130374 0.193534 0.184312 0.210136 0.165157
charge: -0.162228 0.168446 -0.125809 0.164375 -0.187942 -0.103963 -0.213959 0.150619 0.150261 -0.201617 0.144943 0.153881 -0.210494 0.091173 0.152901 0.155301 0.195802 0.169340 0.161468 0.196276 0.151226
qa: -0.2253 0.1847 -0.2151 0.1858 -0.1636 -0.0628 -0.2107 0.1486 0.1566 -0.2615 0.1490 0.1596 -0.1106 0.0749 0.1296 0.1774 0.1304 0.1935 0.1843 0.2101 0.1652
va: 3.8471 0.9608 3.8381 0.9562 3.7970 3.8175 3.8488 0.9688 0.9729 3.9002 0.9666 0.9692 3.6995 3.6177 0.9681 0.9599 1.0191 0.9540 0.9649 0.9467 0.9642
dispcorr: -0.036901888 hartree
energy: -312.238574246497
dipole: 0.12068 -0.93538 -0.81470 1.27839 -0.30579 0.97260 0.42790 -0.50725 -0.07934
magnitude: 1.27121 au
magnitude: 3.23117 debye
