program: Orca
programVersion: 5.0.3
elementType: C H C H C C C H H C H H C C H H H H H H H
charge: 1
multiplicity: 1
keywords: DSD-PBEP86 cc-pVTZ EnGrad RIJCOSX verytightscf cc-pVTZ/C def2/J soscf
formula: C8H13
InChI: InChI=1/C8H13/c1-2-4-6-8-7-5-3-1/h1-2,7H,3-6,8H2
21 atoms
C  -2.00197 0.725193 0.080165
H  -2.204074 0.872898 1.144801
C  -1.760391 -0.93026 -0.144376
H  -2.618968 -1.362239 0.374648
C  -0.429274 -1.358053 0.408428
C  0.697374 -1.284624 -0.36437
C  2.008756 -0.687103 0.070293
H  2.222232 -0.879183 1.127246
H  2.859223 -1.021984 -0.527542
C  1.801429 0.896845 -0.144118
H  1.860356 1.132513 -1.211864
H  2.615363 1.424907 0.356605
C  0.424744 1.270473 0.439122
C  -0.743904 1.319491 -0.371155
H  0.530649 -1.20911 -1.443501
H  -1.850199 -1.127057 -1.214974
H  0.077693 0.204773 0.760008
H  -0.604998 1.347041 -1.456239
H  -2.869116 0.991844 -0.524981
H  0.367998 1.716631 1.440555
H  -0.347488 -1.517718 1.485737
totalener: -311.09355851 hartree
nucrepener: 381.28583886 hartree
electener: -692.37939738 hartree
oneelecener: -1162.73201597 hartree
twoeener: 470.35261860 hartree
kineticenergy: 309.67252822 hartree
exchangeener: -12.747826905442 hartree
correlationener: -0.946469983375 hartree
xcener: -13.694296888816 hartree
chargesum: 1.0000000
charge: -0.252202 0.185920 -0.277803 0.195924 -0.124828 -0.090944 -0.246340 0.165875 0.182171 -0.273328 0.168669 0.184885 -0.172849 0.044710 0.175609 0.182811 0.126449 0.204992 0.198864 0.222266 0.199151
charge: 0.115111 0.004920 0.132528 0.006418 0.048142 0.116037 0.087100 -0.003493 -0.001273 0.112556 -0.008582 -0.000894 0.097515 0.257726 -0.009716 -0.003670 0.008315 0.010259 0.006877 0.031306 -0.007181
qa: -0.2522 0.1859 -0.2778 0.1959 -0.1248 -0.0909 -0.2463 0.1659 0.1822 -0.2733 0.1687 0.1849 -0.1728 0.0447 0.1756 0.1828 0.1264 0.2050 0.1989 0.2223 0.1992
va: 3.8823 0.9768 3.9411 0.9689 3.8167 3.8351 3.8966 0.9838 0.9731 3.9218 0.9827 0.9760 3.8216 3.6817 0.9791 0.9766 1.0817 0.9694 0.9698 0.9711 0.9771
energy: -311.807063504282
dipole: 0.03627 -0.51329 -0.47702 0.53777 0.06158 0.59935 0.29124 -0.31931 -0.02807
magnitude: 0.76652 au
magnitude: 1.94835 debye
