program: Orca
programVersion: 5.0.3
elementType: C H C H C C C H H C H H C C H H H H H H H
charge: 1
multiplicity: 1
keywords: b3lyp def2-TZVP EnGrad RIJCOSX verytightscf def2/J soscf
formula: C8H13
InChI: InChI=1/C8H13/c1-2-4-6-8-7-5-3-1/h1-2,7H,3-6,8H2
21 atoms
C  -1.992649 0.547129 0.114293
H  -2.168165 0.733518 1.177851
C  -1.905371 -0.982192 -0.174544
H  -2.669675 -1.555368 0.355098
C  -0.487066 -1.216335 0.307058
C  0.624869 -1.174847 -0.482459
C  1.91625 -0.670971 0.070846
H  2.038667 -0.949695 1.122861
H  2.782061 -1.040381 -0.486759
C  1.861597 0.888062 -0.061556
H  1.944877 1.163549 -1.119729
H  2.71303 1.341615 0.453373
C  0.533711 1.473352 0.504251
C  -0.600501 0.970957 -0.292273
H  0.53319 -1.308516 -1.560328
H  -1.994523 -1.180327 -1.247301
H  0.404001 1.283295 1.573845
H  -0.466092 1.07022 -1.372934
H  -2.763579 1.056273 -0.475271
H  0.582202 2.569036 0.365136
H  -0.344612 -1.181897 1.388821
totalener: -312.24508475 hartree
nucrepener: 383.00407830 hartree
electener: -695.24916305 hartree
oneelecener: -1166.99393869 hartree
twoeener: 471.74477563 hartree
kineticenergy: 310.53570307 hartree
exchangeener: -36.332572905425 hartree
correlationener: -2.306303122414 hartree
xcener: -38.638876027839 hartree
chargesum: 1.0000000
charge: -0.186694 0.155295 -0.190198 0.165879 -0.069674 -0.071157 -0.208763 0.149006 0.162153 -0.217921 0.144453 0.163101 -0.151970 -0.006764 0.174299 0.150442 0.146109 0.183724 0.167822 0.182651 0.158208
charge: -0.200593 0.156787 -0.194791 0.152260 -0.062546 -0.075032 -0.212618 0.155087 0.160234 -0.203195 0.149231 0.153662 -0.220877 0.086233 0.161090 0.154675 0.156397 0.170351 0.159806 0.189889 0.163951
qa: -0.1867 0.1553 -0.1902 0.1659 -0.0697 -0.0712 -0.2088 0.1490 0.1622 -0.2179 0.1445 0.1631 -0.1520 -0.0068 0.1743 0.1504 0.1461 0.1837 0.1678 0.1827 0.1582
va: 3.8506 0.9714 3.8370 0.9708 3.8135 3.8040 3.8866 0.9687 0.9698 3.8488 0.9687 0.9649 3.8672 3.6542 0.9595 0.9733 0.9738 0.9523 0.9690 0.9608 0.9658
energy: -312.245084750866
dipole: 0.55419 -0.81469 -0.26050 1.87342 -1.40012 0.47330 0.16350 -0.29246 -0.12896
magnitude: 0.55543 au
magnitude: 1.41179 debye
