program: Orca
programVersion: 5.0.3
elementType: C H C H C C C H H C H H C C H H H H H H H
charge: 1
multiplicity: 1
keywords: b3lyp cc-pVTZ EnGrad RIJCOSX verytightscf cc-pVTZ/C def2/J soscf
formula: C8H13
InChI: InChI=1/C8H13/c1-2-4-6-8-7-5-3-1/h1-2,7H,3-6,8H2
21 atoms
C  -1.990543 0.558229 0.106697
H  -2.166454 0.741809 1.171262
C  -1.879219 -0.974948 -0.174862
H  -2.664704 -1.534652 0.33919
C  -0.471282 -1.250808 0.322189
C  0.632636 -1.198972 -0.468778
C  1.923572 -0.680235 0.072179
H  2.060033 -0.947555 1.125366
H  2.791743 -1.038542 -0.489889
C  1.847255 0.87517 -0.07558
H  1.913282 1.143654 -1.136695
H  2.695725 1.348638 0.42648
C  0.518708 1.460609 0.509344
C  -0.628586 1.044067 -0.304641
H  0.531239 -1.302022 -1.54962
H  -1.95612 -1.171886 -1.248984
H  0.383102 1.227247 1.569082
H  -0.50331 1.201415 -1.380132
H  -2.784092 1.032735 -0.481952
H  0.605158 2.560161 0.414391
H  -0.334515 -1.235323 1.405064
totalener: -312.23674313 hartree
nucrepener: 381.89273179 hartree
electener: -694.12947492 hartree
oneelecener: -1164.76598964 hartree
twoeener: 470.63651472 hartree
kineticenergy: 309.97835583 hartree
exchangeener: -36.305962884248 hartree
correlationener: -2.305416029051 hartree
xcener: -38.611378913298 hartree
chargesum: 1.0000000
charge: -0.164493 0.145960 -0.165627 0.152491 -0.076073 -0.096887 -0.180448 0.134147 0.152313 -0.186034 0.129962 0.153568 -0.163183 0.023171 0.174442 0.137914 0.140942 0.194151 0.157365 0.178936 0.157383
charge: 0.091815 0.002363 0.094846 -0.001899 0.115251 0.100759 0.077809 -0.001792 0.005304 0.108705 -0.007812 -0.001403 0.072705 0.310977 -0.011411 -0.000981 0.001272 0.008033 0.006728 0.036576 -0.007843
qa: -0.1645 0.1460 -0.1656 0.1525 -0.0761 -0.0969 -0.1804 0.1341 0.1523 -0.1860 0.1300 0.1536 -0.1632 0.0232 0.1744 0.1379 0.1409 0.1942 0.1574 0.1789 0.1574
va: 3.8159 0.9894 3.8439 0.9823 3.7866 3.7936 3.8692 0.9917 0.9832 3.8311 0.9892 0.9799 3.8527 3.5863 0.9833 0.9926 0.9922 0.9772 0.9821 0.9741 0.9934
energy: -312.236743131816
dipole: 0.53515 -0.84361 -0.30846 1.89627 -1.23743 0.65883 0.15308 -0.27711 -0.12403
magnitude: 0.73797 au
magnitude: 1.87576 debye
