program: Orca
programVersion: 5.0.3
elementType: C H C H C C C H H C H H C C H H H H H H H
charge: 1
multiplicity: 1
keywords: b3lyp cc-pVTZ EnGrad RIJCOSX verytightscf cc-pVTZ/C def2/J soscf
formula: C8H13
InChI: InChI=1/C8H13/c1-2-4-6-8-7-5-3-1/h1-2,7H,3-6,8H2
21 atoms
C  -1.992303 0.548591 0.113374
H  -2.167837 0.734616 1.17706
C  -1.901636 -0.981158 -0.174652
H  -2.669054 -1.552504 0.35264
C  -0.484799 -1.221513 0.309166
C  0.625943 -1.178411 -0.480611
C  1.917161 -0.672312 0.071091
H  2.041494 -0.949415 1.123304
H  2.783432 -1.040097 -0.486998
C  1.859431 0.886214 -0.063535
H  1.940037 1.160633 -1.122191
H  2.710642 1.342622 0.449289
C  0.53169 1.471895 0.505114
C  -0.604464 0.981607 -0.294184
H  0.532996 -1.308067 -1.558916
H  -1.988962 -1.178991 -1.247648
H  0.401096 1.275965 1.573473
H  -0.470826 1.087683 -1.374388
H  -2.766648 1.05289 -0.47596
H  0.585892 2.568302 0.372129
H  -0.343072 -1.189409 1.391098
totalener: -312.24117821 hartree
nucrepener: 382.83622666 hartree
electener: -695.07740487 hartree
oneelecener: -1166.62422054 hartree
twoeener: 471.54681566 hartree
kineticenergy: 309.98363914 hartree
exchangeener: -36.309737712918 hartree
correlationener: -2.306249489162 hartree
xcener: -38.615987202081 hartree
chargesum: 1.0000000
charge: -0.164807 0.144118 -0.166020 0.152807 -0.064949 -0.084392 -0.182654 0.134317 0.152809 -0.186717 0.130036 0.153219 -0.164096 0.007575 0.179795 0.137752 0.139912 0.188777 0.156261 0.176298 0.159959
charge: 0.092258 0.000793 0.095837 -0.001970 0.121515 0.116953 0.079388 -0.001327 0.005273 0.105648 -0.007479 -0.001405 0.071179 0.292480 -0.008876 -0.001029 0.000524 0.005522 0.005228 0.033371 -0.003883
qa: -0.1648 0.1441 -0.1660 0.1528 -0.0649 -0.0844 -0.1827 0.1343 0.1528 -0.1867 0.1300 0.1532 -0.1641 0.0076 0.1798 0.1378 0.1399 0.1888 0.1563 0.1763 0.1600
va: 3.8195 0.9902 3.8412 0.9827 3.7808 3.7852 3.8713 0.9915 0.9832 3.8334 0.9888 0.9801 3.8519 3.6121 0.9810 0.9929 0.9915 0.9810 0.9818 0.9744 0.9930
energy: -312.241178213230
dipole: 0.55213 -0.81828 -0.26615 1.87614 -1.37852 0.49762 0.16184 -0.28937 -0.12754
magnitude: 0.57855 au
magnitude: 1.47057 debye
