program: Orca
programVersion: 5.0.3
elementType: C H C H C C C H H C H H C C H H H H H H H
charge: 1
multiplicity: 1
keywords: PBE0 def2-TZVP EnGrad D3BJ RIJCOSX verytightscf def2/J soscf
formula: C8H13
InChI: InChI=1/C8H13/c1-2-4-6-8-7-5-3-1/h1-2,7H,3-6,8H2
21 atoms
C  -1.999366 0.759537 0.069766
H  -2.161951 0.828418 1.148025
C  -1.72973 -0.968504 -0.159322
H  -2.618448 -1.319428 0.369382
C  -0.415584 -1.387202 0.392263
C  0.685547 -1.275468 -0.378849
C  2.000817 -0.692747 0.062737
H  2.20832 -0.891782 1.119691
H  2.855559 -1.034645 -0.526958
C  1.788637 0.855035 -0.139386
H  1.828645 1.116513 -1.202496
H  2.592399 1.404273 0.357939
C  0.422172 1.264708 0.490723
C  -0.767738 1.299402 -0.371573
H  0.520807 -1.199802 -1.458405
H  -1.833248 -1.128188 -1.233001
H  0.193851 0.60682 1.3345
H  -0.659345 1.599145 -1.417608
H  -2.882934 0.993179 -0.522485
H  0.474789 2.267894 0.964205
H  -0.333752 -1.485087 1.4742
totalener: -312.03564734 hartree
nucrepener: 379.43143681 hartree
electener: -691.46708415 hartree
oneelecener: -1159.92439392 hartree
twoeener: 468.45730977 hartree
kineticenergy: 310.16703751 hartree
exchangeener: -34.165714250411 hartree
correlationener: -1.961210858624 hartree
xcener: -36.126925109035 hartree
chargesum: 1.0000000
charge: -0.251024 0.202338 -0.211334 0.197267 -0.209189 -0.078722 -0.225415 0.159983 0.166421 -0.269005 0.158593 0.171686 -0.163857 0.072490 0.137216 0.190921 0.159697 0.202920 0.196843 0.218230 0.173941
charge: -0.165556 0.174858 -0.119880 0.165711 -0.189382 -0.116834 -0.224331 0.154751 0.154197 -0.208901 0.148986 0.157326 -0.213293 0.092909 0.156463 0.158447 0.178498 0.173518 0.163523 0.205717 0.153276
qa: -0.2510 0.2023 -0.2113 0.1973 -0.2092 -0.0787 -0.2254 0.1600 0.1664 -0.2690 0.1586 0.1717 -0.1639 0.0725 0.1372 0.1909 0.1597 0.2029 0.1968 0.2182 0.1739
va: 3.9215 0.9564 3.8768 0.9554 3.9135 3.9042 3.9152 0.9698 0.9731 3.9707 0.9680 0.9660 3.8438 3.7048 0.9677 0.9583 0.9981 0.9515 0.9637 0.9466 0.9618
dispcorr: -0.018965165 hartree
energy: -312.054612504214
dipole: 0.17293 -1.02849 -0.85556 1.64566 -0.53662 1.10905 0.38114 -0.49569 -0.11455
magnitude: 1.40538 au
magnitude: 3.57218 debye
