program: Orca
programVersion: 5.0.3
elementType: C H C H C C C H H C H H C C H H H H H H H
charge: 1
multiplicity: 1
keywords: DSD-PBEP86 cc-pVTZ EnGrad RIJCOSX verytightscf cc-pVTZ/C def2/J soscf
formula: C8H13
InChI: InChI=1/C8H13/c1-2-4-6-8-7-5-3-1/h1-2,7H,3-6,8H2
21 atoms
C  -1.99864 0.740193 0.076555
H  -2.189522 0.862388 1.146201
C  -1.747069 -0.940491 -0.147572
H  -2.61837 -1.33836 0.377924
C  -0.42637 -1.36954 0.403275
C  0.694078 -1.284067 -0.366973
C  2.006658 -0.687466 0.067245
H  2.219205 -0.878119 1.124935
H  2.858618 -1.026202 -0.526985
C  1.797813 0.887788 -0.145122
H  1.854647 1.130854 -1.2114
H  2.608443 1.422514 0.354925
C  0.422771 1.257858 0.455117
C  -0.755925 1.317662 -0.377311
H  0.529621 -1.21325 -1.446726
H  -1.844554 -1.123685 -1.218886
H  0.118308 0.310124 0.967057
H  -0.630205 1.419229 -1.459126
H  -2.872845 0.985835 -0.526567
H  0.39291 1.896097 1.352771
H  -0.346121 -1.513078 1.48242
totalener: -311.10242201 hartree
nucrepener: 380.60832536 hartree
electener: -691.71074737 hartree
oneelecener: -1161.48862451 hartree
twoeener: 469.77787714 hartree
kineticenergy: 309.70121611 hartree
exchangeener: -12.749531192871 hartree
correlationener: -0.944951656031 hartree
xcener: -13.694482848902 hartree
chargesum: 1.0000000
charge: -0.257088 0.193075 -0.263063 0.199895 -0.146520 -0.110629 -0.244238 0.161431 0.178908 -0.268963 0.165607 0.183042 -0.228080 0.086115 0.170858 0.188086 0.149015 0.216577 0.202792 0.230007 0.193175
charge: 0.123201 0.009735 0.149760 0.009012 0.027658 0.091763 0.081835 -0.004425 -0.002898 0.108831 -0.011100 -0.001468 0.085374 0.293110 -0.014413 -0.001675 0.009162 0.013656 0.008262 0.038522 -0.013902
qa: -0.2571 0.1931 -0.2631 0.1999 -0.1465 -0.1106 -0.2442 0.1614 0.1789 -0.2690 0.1656 0.1830 -0.2281 0.0861 0.1709 0.1881 0.1490 0.2166 0.2028 0.2300 0.1932
va: 3.8879 0.9738 3.9317 0.9663 3.8256 3.8410 3.9051 0.9852 0.9745 3.9064 0.9833 0.9758 3.8487 3.6099 0.9806 0.9738 1.0419 0.9649 0.9695 0.9648 0.9798
energy: -311.811379198926
dipole: 0.07513 -0.80474 -0.72961 0.87611 -0.02281 0.85330 0.39056 -0.44371 -0.05315
magnitude: 1.12396 au
magnitude: 2.85687 debye
