program: Orca
programVersion: 5.0.3
elementType: C H C H C C C H H C H H C C H H H H H H H
charge: 1
multiplicity: 1
keywords: DSD-PBEP86 def2-TZVP D3BJ RIJCOSX verytightscf def2-TZVP/C def2/J soscf noTRAH
formula: C8H13
InChI: InChI=1/C8H13/c1-2-4-6-8-7-5-3-1/h1-2,7H,3-6,8H2
21 atoms
C  -1.997068 0.531378 0.120048
H  -2.174447 0.723357 1.18181
C  -1.950467 -0.995568 -0.171029
H  -2.675345 -1.587052 0.390743
C  -0.51469 -1.148184 0.284325
C  0.611875 -1.129137 -0.501871
C  1.907957 -0.653926 0.065829
H  2.010142 -0.952114 1.114664
H  2.764575 -1.044316 -0.490401
C  1.891057 0.910553 -0.038479
H  2.01188 1.201212 -1.088721
H  2.73957 1.329086 0.509212
C  0.555208 1.481576 0.491797
C  -0.553791 0.840107 -0.26694
H  0.5316 -1.302295 -1.574635
H  -2.062739 -1.203081 -1.239342
H  0.437385 1.353161 1.572587
H  -0.425437 0.902643 -1.35049
H  -2.721902 1.094447 -0.476836
H  0.530504 2.564107 0.284922
H  -0.365353 -1.097432 1.36419
totalener: -311.15278550 hartree
nucrepener: 385.20427933 hartree
electener: -696.35706483 hartree
oneelecener: -1170.68612414 hartree
twoeener: 474.32905931 hartree
kineticenergy: 310.02817215 hartree
exchangeener: -13.674501048561 hartree
correlationener: -0.926338813776 hartree
xcener: -14.600839862336 hartree
chargesum: 1.0000000
charge: -0.201522 0.164243 -0.198837 0.177804 -0.083876 -0.071501 -0.223168 0.157944 0.175360 -0.235321 0.151189 0.173424 -0.204640 -0.014807 0.200159 0.159601 0.151967 0.185076 0.175961 0.183286 0.177656
charge: -0.192718 0.153240 -0.187130 0.149539 -0.061571 -0.030994 -0.206961 0.154048 0.156632 -0.206213 0.146196 0.150514 -0.223633 0.062153 0.163881 0.152096 0.152118 0.171311 0.152289 0.175514 0.169689
qa: -0.2015 0.1642 -0.1988 0.1778 -0.0839 -0.0715 -0.2232 0.1579 0.1754 -0.2353 0.1512 0.1734 -0.2046 -0.0148 0.2002 0.1596 0.1520 0.1851 0.1760 0.1833 0.1777
va: 3.8671 0.9735 3.8664 0.9720 3.8485 3.8141 3.9044 0.9691 0.9687 3.8701 0.9716 0.9665 3.9183 3.6941 0.9485 0.9741 0.9726 0.9540 0.9707 0.9648 0.9609
total: -311.826860145 hartree
dispcorr: -0.011652386 hartree
energy: -311.838512530646
dipole: 0.56268 -0.78277 -0.22009 1.85503 -1.67585 0.17919 0.18512 -0.36699 -0.18187
magnitude: 0.33708 au
magnitude: 0.85680 debye
