program: Orca
programVersion: 5.0.3
elementType: C H C H C C C H H C H H C C H H H H H H H
charge: 1
multiplicity: 1
keywords: DSD-PBEP86/2013 def2-TZVP RIJCOSX verytightscf def2-TZVP/C def2/J soscf noTRAH
formula: C8H13
InChI: InChI=1/C8H13/c1-2-4-6-8-7-5-3-1/h1-2,7H,3-6,8H2
21 atoms
C  -1.997114 0.754415 0.072806
H  -2.171925 0.84688 1.147729
C  -1.735646 -0.95428 -0.152379
H  -2.618408 -1.319307 0.377315
C  -0.421834 -1.380591 0.39747
C  0.689862 -1.2810 -0.371401
C  2.004123 -0.688629 0.064554
H  2.21494 -0.880635 1.122322
H  2.857322 -1.030772 -0.526582
C  1.79312 0.874029 -0.144146
H  1.843987 1.126567 -1.208657
H  2.599379 1.416535 0.355828
C  0.421889 1.253249 0.474367
C  -0.764999 1.31018 -0.379136
H  0.526249 -1.210658 -1.45141
H  -1.839077 -1.12255 -1.224889
H  0.158024 0.442276 1.174194
H  -0.651587 1.513781 -1.447665
H  -2.878153 0.985088 -0.525108
H  0.430224 2.098259 1.185317
H  -0.342029 -1.50002 1.478379
totalener: -311.12057117 hartree
nucrepener: 379.92716152 hartree
electener: -691.04773269 hartree
oneelecener: -1160.23980369 hartree
twoeener: 469.19207100 hartree
kineticenergy: 309.98577545 hartree
exchangeener: -12.753403232143 hartree
correlationener: -0.943933491151 hartree
xcener: -13.697336723294 hartree
chargesum: 1.0000000
charge: -0.264706 0.198053 -0.210718 0.194242 -0.202080 -0.116650 -0.213520 0.157127 0.166682 -0.284810 0.155476 0.170335 -0.134843 0.102603 0.142549 0.185890 0.141049 0.210926 0.196552 0.226858 0.178986
charge: -0.168731 0.166730 -0.122914 0.159082 -0.196442 -0.118209 -0.212088 0.147965 0.147229 -0.201526 0.141309 0.150297 -0.215350 0.154809 0.150763 0.152921 0.192696 0.173239 0.158746 0.190374 0.149101
qa: -0.2647 0.1981 -0.2107 0.1942 -0.2021 -0.1167 -0.2135 0.1571 0.1667 -0.2848 0.1555 0.1703 -0.1348 0.1026 0.1425 0.1859 0.1410 0.2109 0.1966 0.2269 0.1790
va: 3.8608 0.9599 3.8533 0.9564 3.8225 3.8692 3.8618 0.9714 0.9740 3.9116 0.9684 0.9701 3.7157 3.5615 0.9677 0.9597 1.0167 0.9463 0.9643 0.9398 0.9608
total: -311.806069682 hartree
energy: -311.806069681609
dipole: 0.12068 -1.01661 -0.89594 1.27839 -0.10266 1.17573 0.42790 -0.57906 -0.15116
magnitude: 1.48590 au
magnitude: 3.77686 debye
