program: Gaussian 09
title: 000050895
version: EM64L-G09RevD.01
frameworkgroup: C1[X(C15H11ClF3NO4)]
method: RPBEPBE
basis: SDD
operation: Freq
keyword: #p
keyword: freq=noraman
keyword: PBEPBE/SDD
title: #p freq=noraman PBEPBE/SDD
converged: YES YES NO NO
title: Mulliken charges:
elementType: Cl F F F O O O O N C C C C C C C C C C C C C C C H H H H H H H H H H H
charge: 0.007158 -0.163659 -0.161350 -0.159108 -0.265249 -0.273520 -0.422978 -0.191686 -0.017373 -0.069957 0.383230 0.395014 -0.377802 -0.323697 -0.289428 -0.408875 -0.711576 0.300560 0.222804 -0.185933 -0.255960 0.169419 -0.434544 0.260834 0.245928 0.257433 0.266249 0.262178 0.259087 0.251704 0.245222 0.223690 0.293494 0.284201 0.384489
chargesum: 0.00000
title: Mulliken charges with hydrogens summed into heavy atoms:
elementType: Cl F F F O O O O N C C C C C C C C C C C C C C C
charge: 0.007158 -0.163659 -0.161350 -0.159108 -0.265249 -0.273520 -0.038489 -0.191686 -0.017373 0.175971 0.383230 0.395014 -0.120370 -0.057448 -0.027250 -0.149789 0.009040 0.300560 0.222804 0.107561 -0.255960 0.169419 -0.150342 0.260834
polarizability: 3.11823304e+02 3.73292761e+00 1.93445213e+02 7.51667760e+00 -1.04981544e+01 1.20242551e+02
1716.lowfreq: -7.8633 0.0018 0.0020 0.0021 1.2111 4.0699 7.2838 12.4848 25.1198
frequency: 4.8640 12.2013 25.0761 29.1154 31.8519 43.8233 68.2001 83.4259 115.8793 130.1203 135.7086 142.9879 166.8361 209.0909 221.4488 240.4779 248.3907 271.4375 286.5774 301.2911 334.2397 367.4378 377.2594 388.8827 412.7336 417.7817 439.9863 446.0903 485.1057 487.4577 509.2384 525.8557 574.7558 598.3053 611.5180 615.1782 621.9043 639.0969 648.9794 689.4673 713.1089 721.6678 741.9603 754.6083 778.8625 807.9188 808.8054 830.2897 884.8672 902.2791 922.2961 926.9777 938.1083 952.7654 982.0930 999.6537 1000.4982 1019.6442 1028.8312 1033.7739 1054.9712 1086.2845 1116.6465 1136.8082 1154.2319 1177.9363 1213.9791 1220.6343 1238.8659 1278.6805 1294.9428 1301.4360 1325.0720 1339.4323 1344.9374 1379.2445 1384.0299 1390.7737 1420.1818 1445.7273 1461.3036 1474.3084 1487.2219 1529.8030 1585.0779 1592.7608 1620.6908 1682.9423 3004.7791 3020.7840 3107.9556 3118.6989 3155.0197 3164.9346 3167.1376 3175.1534 3175.5146 3193.3238 3508.1592
redmass: 7.6471 16.3658 9.8156 8.7596 7.0077 7.7794 5.7488 5.6236 6.7352 9.7397 7.3530 7.0159 8.0987 1.8060 1.6100 7.6525 6.9528 6.9893 6.5720 7.3502 6.8229 7.2375 8.0960 9.5356 9.6340 3.0259 6.1281 5.4597 6.9166 4.4570 2.8214 8.9724 6.4960 3.8500 5.5879 1.8169 5.2110 4.5641 11.0983 5.0405 4.4346 4.6867 6.4690 5.2670 3.2306 4.2502 1.3751 1.6892 7.4345 1.4425 3.0964 1.4459 1.3667 1.3541 10.0408 3.6889 6.0068 2.6435 8.4463 2.4171 3.3270 1.9148 1.3374 2.2003 2.0224 1.4692 2.7817 2.4576 1.5872 4.5354 2.2286 1.4475 1.3016 4.9599 1.5590 5.3325 3.9850 1.2428 3.7142 3.6396 1.0457 1.0537 2.4763 8.4634 6.3591 7.0518 7.0264 8.8851 1.0348 1.0852 1.1000 1.1016 1.0886 1.0929 1.0897 1.0967 1.0942 1.0966 1.0641
irintensity: 0.3766 0.1132 1.3460 0.4191 0.1350 0.4391 0.3156 0.8327 0.7073 1.8955 0.6392 1.4714 2.7546 0.8452 0.4218 0.9762 2.0992 1.2575 3.6320 0.5346 6.9000 1.8099 1.4570 1.9322 3.7149 0.0012 1.8611 0.9251 0.9000 14.4338 31.9509 1.6765 26.9895 11.9008 5.3141 93.6759 11.4128 57.3715 7.0907 6.7811 35.9792 6.9258 16.6485 25.2938 14.3066 25.9315 3.1189 86.2247 19.2093 41.0049 45.2113 34.5134 1.5927 2.1086 231.6986 26.9061 320.8880 296.8118 40.8095 33.2891 107.3399 62.5877 30.1354 0.1704 88.3968 323.0881 108.7680 164.6872 3.3597 340.7700 435.8419 34.5190 0.8781 12.2087 16.4758 14.5193 127.1852 33.2474 0.2159 195.3199 13.5674 12.6004 272.9924 4.1764 187.4950 21.1042 31.0689 176.7572 13.2619 16.1472 16.7301 12.6011 8.3246 4.2727 4.3331 1.6462 1.4128 2.1476 28.3027
temp: 298.150 k
press: 1.00000 atm
elementType: 17 9 9 9 8 8 8 8 7 6 6 6 6 6 6 6 6 6 6 6 6 6 6 6 1 1 1 1 1 1 1 1 1 1 1
symmnumber: 1
zpe: 617509.2 jmol-1
zpe.correction: 0.235197 hartree
zpe.thermalcorrener: 0.257745 hartree
zpe.thermalcorrenthalpy: 0.258689 hartree
zpe.thermalcorrgfe: 0.177125 hartree
zpe.sumelectzpe: -1691.679543 hartree
zpe.sumelectthermal: -1691.656995 hartree
zpe.sumelectthermalent: -1691.656051 hartree
zpe.sumelectthermalfe: -1691.737615 hartree
dipole: -3.9830 0.4526 -2.1263
dipole: 4.5377
quadrupole: -140.4260 -139.6505 -147.2168
quadrupole: 5.0940 15.9070 -4.5826
quadrupole: 2.0051 2.7806 -4.7857 5.0940 15.9070 -4.5826
hfenergy: -1691.9147401 hartree
pointgroup: C01 [X(C15H11Cl1F3N1O4)]
dipole: 1.5599488 -0.5397946 0.6799296 debye
polarizability: 311.0828128|-13.6011197|145.5438551|1.3837143|36.2153711|168.8844001 unknown
InChI: InChI=1S/C15H11ClF3NO4/c1-8(14(21)22)23-10-2-4-11(5-3-10)24-13-12(16)6-9(7-20-13)15(17,18)19/h2-8,21H,1H3
charge 0 multiplicity 1
35 atoms
Cl -2.834159 2.62402 2.267637
F  -6.858377 -0.599264 0.513763
F  -6.523448 0.272714 -1.547612
F  -5.979587 -1.890419 -1.142563
O  4.161573 -0.774043 -1.280892
O  -0.733147 1.021897 0.867574
O  6.206789 -0.082738 1.573954
O  6.100375 1.258119 -0.328293
N  -2.163632 -0.406396 -0.386984
C  5.299711 -1.102652 -0.414123
C  2.961742 -0.346449 -0.676456
C  0.466346 0.484318 0.289318
C  1.914904 -0.047399 -1.582396
C  2.760051 -0.218822 0.719634
C  0.661809 0.374149 -1.10514
C  1.499487 0.203267 1.198459
C  6.349418 -1.754826 -1.323552
C  -4.570536 -0.179385 -0.166564
C  -1.992219 0.609209 0.489699
C  -4.397118 0.885673 0.75752
C  -3.098582 1.282579 1.090294
C  5.883665 0.16802 0.229948
C  -3.424892 -0.79603 -0.712588
C  -5.947983 -0.597209 -0.575175
H  4.986086 -1.796029 0.388748
H  2.104265 -0.146224 -2.654905
H  3.554561 -0.43211 1.440415
H  -0.146256 0.599474 -1.803735
H  1.318075 0.321018 2.27061
H  6.643581 -1.053932 -2.122085
H  5.923332 -2.661988 -1.78268
H  7.243811 -2.03694 -0.741272
H  -5.258942 1.382922 1.211307
H  -3.509824 -1.627961 -1.417735
H  6.643121 0.720034 1.971068
