program: Orca
programVersion: 5.0.3
elementType: C H C H C C C H H C H H C C H H H H H H H
charge: 1
multiplicity: 1
keywords: DSD-PBEP86/2013 cc-pVTZ EnGrad D3BJ RIJCOSX verytightscf cc-pVTZ/C def2/J soscf
formula: C8H13
InChI: InChI=1/C8H13/c1-2-4-6-8-7-5-3-1/h1-2,7H,3-6,8H2
21 atoms
C  -1.993003 0.545699 0.115152
H  -2.168523 0.732446 1.178585
C  -1.909109 -0.983232 -0.174414
H  -2.670269 -1.558202 0.357624
C  -0.489338 -1.211074 0.304973
C  0.6238 -1.171245 -0.484271
C  1.915378 -0.669621 0.070581
H  2.03591 -0.949963 1.122388
H  2.780686 -1.040673 -0.486593
C  1.863805 0.889914 -0.059588
H  1.949831 1.166496 -1.117255
H  2.715393 1.340605 0.457539
C  0.535694 1.47469 0.503349
C  -0.596552 0.960252 -0.290319
H  0.533351 -1.30881 -1.561703
H  -2.00011 -1.181728 -1.246916
H  0.406888 1.290395 1.574126
H  -0.461574 1.053248 -1.371374
H  -2.760456 1.059646 -0.474684
H  0.578394 2.569593 0.35817
H  -0.346186 -1.174433 1.386565
totalener: -311.15896279 hartree
nucrepener: 383.17464239 hartree
electener: -694.33360518 hartree
oneelecener: -1166.65939211 hartree
twoeener: 472.32578693 hartree
kineticenergy: 309.72927348 hartree
exchangeener: -14.122973102859 hartree
correlationener: -0.945656976394 hartree
xcener: -15.068630079253 hartree
chargesum: 1.0000000
charge: -0.224782 0.171416 -0.226746 0.182373 -0.087781 -0.109987 -0.244514 0.163269 0.181046 -0.245900 0.156635 0.181759 -0.232257 -0.012378 0.217328 0.165503 0.168957 0.214877 0.183830 0.203259 0.194092
charge: 0.088896 0.001685 0.092992 -0.000633 0.123364 0.122864 0.075976 -0.000211 0.005875 0.100476 -0.006630 -0.000502 0.065353 0.290444 -0.005541 0.000096 0.001259 0.006735 0.005539 0.032109 -0.000146
qa: -0.2248 0.1714 -0.2267 0.1824 -0.0878 -0.1100 -0.2445 0.1633 0.1810 -0.2459 0.1566 0.1818 -0.2323 -0.0124 0.2173 0.1655 0.1690 0.2149 0.1838 0.2033 0.1941
va: 3.8635 0.9838 3.8870 0.9762 3.8161 3.8200 3.9162 0.9849 0.9769 3.8863 0.9825 0.9723 3.9036 3.6636 0.9646 0.9868 0.9832 0.9672 0.9753 0.9664 0.9786
dispcorr: -0.014321427 hartree
energy: -311.846741917691
dipole: 0.55602 -0.82769 -0.27166 1.87088 -1.44267 0.42821 0.16520 -0.30148 -0.13628
magnitude: 0.52511 au
magnitude: 1.33472 debye
