program: Orca
programVersion: 5.0.3
elementType: C H C H C C C H H C H H C C H H H H H H H
charge: 1
multiplicity: 1
keywords: DSD-PBEP86 def2-TZVP RIJCOSX verytightscf def2-TZVP/C def2/J soscf noTRAH
formula: C8H13
InChI: InChI=1/C8H13/c1-2-4-6-8-7-5-3-1/h1-2,7H,3-6,8H2
21 atoms
C  -1.999455 0.522228 0.115178
H  -2.181722 0.726231 1.173673
C  -1.980634 -1.006446 -0.163189
H  -2.678893 -1.602165 0.425957
C  -0.533323 -1.101191 0.274785
C  0.600479 -1.094806 -0.513122
C  1.904425 -0.640537 0.05714
H  1.998372 -0.955452 1.101847
H  2.749549 -1.045787 -0.505489
C  1.91509 0.926226 -0.021131
H  2.069005 1.233668 -1.061901
H  2.753908 1.319054 0.559361
C  0.566771 1.477881 0.483278
C  -0.522685 0.753976 -0.250775
H  0.521358 -1.286613 -1.582646
H  -2.109626 -1.230853 -1.225802
H  0.454952 1.380423 1.568323
H  -0.409457 0.828807 -1.335573
H  -2.687564 1.113198 -0.496069
H  0.49254 2.54825 0.240466
H  -0.378991 -1.053383 1.353654
totalener: -311.18472181 hartree
nucrepener: 386.75097793 hartree
electener: -697.93569974 hartree
oneelecener: -1173.72989300 hartree
twoeener: 475.79419325 hartree
kineticenergy: 310.02697610 hartree
exchangeener: -12.765816216160 hartree
correlationener: -0.949492720593 hartree
xcener: -13.715308936754 hartree
chargesum: 1.0000000
charge: -0.196621 0.163914 -0.196196 0.178593 -0.073751 -0.041369 -0.224388 0.160028 0.178499 -0.238577 0.153073 0.173370 -0.210564 -0.050623 0.208562 0.159450 0.148610 0.174739 0.174468 0.177325 0.181463
charge: -0.185441 0.152463 -0.180438 0.149187 -0.062655 0.001072 -0.201922 0.155501 0.157489 -0.206538 0.146228 0.150574 -0.223184 0.012557 0.167102 0.151732 0.150380 0.172580 0.149067 0.169467 0.174779
qa: -0.1966 0.1639 -0.1962 0.1786 -0.0738 -0.0414 -0.2244 0.1600 0.1785 -0.2386 0.1531 0.1734 -0.2106 -0.0506 0.2086 0.1594 0.1486 0.1747 0.1745 0.1773 0.1815
va: 3.8700 0.9745 3.8752 0.9723 3.8502 3.7794 3.9046 0.9678 0.9678 3.8789 0.9713 0.9679 3.9214 3.7431 0.9434 0.9739 0.9730 0.9601 0.9711 0.9669 0.9596
total: -311.869652538 hartree
energy: -311.869652537643
dipole: 0.55611 -0.69335 -0.13724 1.84908 -1.89584 -0.04676 0.20209 -0.40008 -0.19798
magnitude: 0.24539 au
magnitude: 0.62374 debye
