program: Orca
programVersion: 5.0.3
elementType: C H C H C C C H H C H H C C H H H H H H H
charge: 1
multiplicity: 1
keywords: PBE0 cc-pVTZ EnGrad RIJCOSX verytightscf cc-pVTZ/C def2/J soscf
formula: C8H13
InChI: InChI=1/C8H13/c1-2-4-6-8-7-5-3-1/h1-2,7H,3-6,8H2
21 atoms
C  -2.003188 0.732475 0.07026
H  -2.171557 0.803273 1.147955
C  -1.737325 -0.974824 -0.168646
H  -2.622208 -1.354151 0.347771
C  -0.410202 -1.381127 0.384275
C  0.678489 -1.269194 -0.393122
C  1.991925 -0.703744 0.064015
H  2.192206 -0.919488 1.118867
H  2.850633 -1.038219 -0.525319
C  1.790254 0.834242 -0.128861
H  1.823075 1.097733 -1.19193
H  2.596977 1.383837 0.363445
C  0.430251 1.310297 0.497958
C  -0.762355 1.284124 -0.349583
H  0.515411 -1.188223 -1.472444
H  -1.828578 -1.138695 -1.24356
H  0.235882 0.818798 1.453982
H  -0.658328 1.637441 -1.3796
H  -2.877357 0.996233 -0.52454
H  0.533059 2.395348 0.725759
H  -0.321113 -1.462019 1.466882
totalener: -312.03762115 hartree
nucrepener: 379.05764057 hartree
electener: -691.09526172 hartree
oneelecener: -1159.15589415 hartree
twoeener: 468.06063244 hartree
kineticenergy: 309.64847077 hartree
exchangeener: -34.148158424757 hartree
correlationener: -1.959788817807 hartree
xcener: -36.107947242564 hartree
chargesum: 1.0000000
charge: -0.199904 0.176417 -0.178238 0.170034 -0.155315 -0.107978 -0.170383 0.135712 0.147417 -0.198263 0.136813 0.150747 -0.191910 0.101224 0.139985 0.165545 0.147983 0.207306 0.176686 0.186229 0.159894
charge: 0.129800 0.014695 0.167049 0.005376 0.022587 0.058089 0.070481 -0.002233 -0.000102 0.107462 -0.008936 0.000399 0.082268 0.306278 -0.015956 -0.000791 0.007844 0.020075 0.006485 0.051379 -0.022249
qa: -0.1999 0.1764 -0.1782 0.1700 -0.1553 -0.1080 -0.1704 0.1357 0.1474 -0.1983 0.1368 0.1507 -0.1919 0.1012 0.1400 0.1655 0.1480 0.2073 0.1767 0.1862 0.1599
va: 3.8508 0.9823 3.8778 0.9793 3.8084 3.8366 3.8808 0.9948 0.9887 3.8698 0.9920 0.9855 3.8972 3.5633 0.9943 0.9838 1.0008 0.9715 0.9850 0.9779 0.9931
energy: -312.037621150496
dipole: 0.25106 -1.06127 -0.81021 1.90253 -0.66555 1.23698 0.26897 -0.39910 -0.13013
magnitude: 1.48442 au
magnitude: 3.77309 debye
