program: Orca
programVersion: 5.0.3
elementType: C H C H C C C H H C H H C C H H H H H H H
charge: 1
multiplicity: 1
keywords: DSD-PBEP86/2013 cc-pVTZ EnGrad RIJCOSX verytightscf cc-pVTZ/C def2/J soscf
formula: C8H13
InChI: InChI=1/C8H13/c1-2-4-6-8-7-5-3-1/h1-2,7H,3-6,8H2
21 atoms
C  -1.990782 0.556493 0.107938
H  -2.16661 0.740522 1.17234
C  -1.882965 -0.9760 -0.174878
H  -2.665509 -1.537714 0.341289
C  -0.473531 -1.246132 0.319983
C  0.631481 -1.195647 -0.470835
C  1.922378 -0.678925 0.07204
H  2.056743 -0.947877 1.125093
H  2.790331 -1.038788 -0.489238
C  1.849193 0.877006 -0.07356
H  1.917483 1.146431 -1.134312
H  2.698287 1.347633 0.430076
C  0.520982 1.462799 0.508768
C  -0.624517 1.033854 -0.303024
H  0.531593 -1.303441 -1.55127
H  -1.961536 -1.173004 -1.248844
H  0.38619 1.235923 1.570096
H  -0.497462 1.181549 -1.379588
H  -2.781279 1.036046 -0.480754
H  0.602328 2.561963 0.407329
H  -0.335865 -1.227582 1.402714
totalener: -311.16175729 hartree
nucrepener: 382.04193197 hartree
electener: -693.20368926 hartree
oneelecener: -1164.41399752 hartree
twoeener: 471.21030826 hartree
kineticenergy: 309.72248318 hartree
exchangeener: -12.755043790030 hartree
correlationener: -0.944785053851 hartree
xcener: -13.699828843881 hartree
chargesum: 1.0000000
charge: -0.230507 0.176576 -0.229955 0.184048 -0.105851 -0.131936 -0.246459 0.165834 0.182674 -0.249944 0.158924 0.183986 -0.236876 0.009684 0.213850 0.167667 0.173573 0.224599 0.186923 0.209317 0.193872
charge: 0.087190 0.003985 0.090679 0.000013 0.113902 0.100310 0.072658 -0.000323 0.006244 0.103010 -0.006486 -0.000016 0.066534 0.316006 -0.008607 0.000635 0.002939 0.010920 0.007978 0.037040 -0.004610
qa: -0.2305 0.1766 -0.2300 0.1840 -0.1059 -0.1319 -0.2465 0.1658 0.1827 -0.2499 0.1589 0.1840 -0.2369 0.0097 0.2139 0.1677 0.1736 0.2246 0.1869 0.2093 0.1939
va: 3.8628 0.9814 3.8943 0.9747 3.8268 3.8342 3.9159 0.9843 0.9761 3.8871 0.9820 0.9714 3.9092 3.6263 0.9665 0.9858 0.9825 0.9607 0.9749 0.9648 0.9784
energy: -311.863046863647
dipole: 0.53854 -0.86823 -0.32969 1.89250 -1.24826 0.64424 0.15437 -0.28663 -0.13226
magnitude: 0.73569 au
magnitude: 1.86997 debye
