program: Orca
programVersion: 5.0.3
elementType: C H C H C C C H H C H H C C H H H H H H H
charge: 1
multiplicity: 1
keywords: DSD-PBEP86/2013 cc-pVTZ EnGrad RIJCOSX verytightscf cc-pVTZ/C def2/J soscf
formula: C8H13
InChI: InChI=1/C8H13/c1-2-4-6-8-7-5-3-1/h1-2,7H,3-6,8H2
21 atoms
C  -1.999366 0.759537 0.069766
H  -2.161951 0.828418 1.148025
C  -1.72973 -0.968504 -0.159322
H  -2.618448 -1.319428 0.369382
C  -0.415584 -1.387202 0.392263
C  0.685547 -1.275468 -0.378849
C  2.000817 -0.692747 0.062737
H  2.20832 -0.891782 1.119691
H  2.855559 -1.034645 -0.526958
C  1.788637 0.855035 -0.139386
H  1.828645 1.116513 -1.202496
H  2.592399 1.404273 0.357939
C  0.422172 1.264708 0.490723
C  -0.767738 1.299402 -0.371573
H  0.520807 -1.199802 -1.458405
H  -1.833248 -1.128188 -1.233001
H  0.193851 0.60682 1.3345
H  -0.659345 1.599145 -1.417608
H  -2.882934 0.993179 -0.522485
H  0.474789 2.267894 0.964205
H  -0.333752 -1.485087 1.4742
totalener: -311.12819422 hartree
nucrepener: 379.43143681 hartree
electener: -690.55963104 hartree
oneelecener: -1159.26466100 hartree
twoeener: 468.70502996 hartree
kineticenergy: 309.72759975 hartree
exchangeener: -12.751111112733 hartree
correlationener: -0.942820994467 hartree
xcener: -13.693932107199 hartree
chargesum: 1.0000000
charge: -0.269863 0.202704 -0.242277 0.202314 -0.154505 -0.126587 -0.240072 0.158656 0.175939 -0.261864 0.161036 0.179105 -0.249946 0.100350 0.166091 0.193399 0.158451 0.236017 0.204895 0.218786 0.187372
charge: 0.132312 0.014443 0.177657 0.007648 0.019400 0.067633 0.073918 -0.004225 -0.002836 0.104167 -0.011890 -0.001130 0.075330 0.309669 -0.016708 -0.000496 0.007015 0.018689 0.006470 0.044138 -0.021204
qa: -0.2699 0.2027 -0.2423 0.2023 -0.1545 -0.1266 -0.2401 0.1587 0.1759 -0.2619 0.1610 0.1791 -0.2499 0.1003 0.1661 0.1934 0.1585 0.2360 0.2049 0.2188 0.1874
va: 3.8877 0.9699 3.9083 0.9643 3.8224 3.8461 3.9079 0.9862 0.9766 3.8896 0.9835 0.9745 3.9006 3.5552 0.9827 0.9709 1.0016 0.9562 0.9716 0.9617 0.9805
energy: -311.831139476814
dipole: 0.17293 -1.09261 -0.91968 1.64566 -0.52524 1.12042 0.38114 -0.50922 -0.12808
magnitude: 1.45519 au
magnitude: 3.69879 debye
