program: Orca
programVersion: 5.0.3
elementType: C H C H C C C H H C H H C C H H H H H H H
charge: 1
multiplicity: 1
keywords: m062x cc-pVTZ EnGrad RIJCOSX verytightscf cc-pVTZ/C def2/J soscf
formula: C8H13
InChI: InChI=1/C8H13/c1-2-4-6-8-7-5-3-1/h1-2,7H,3-6,8H2
21 atoms
C  -1.990333 0.560033 0.105409
H  -2.166334 0.743144 1.170146
C  -1.875464 -0.97388 -0.174825
H  -2.663864 -1.531547 0.337143
C  -0.469031 -1.255405 0.324406
C  0.633814 -1.202255 -0.466689
C  1.924825 -0.681544 0.0723
H  2.06341 -0.947232 1.12561
H  2.793175 -1.0383 -0.490606
C  1.845351 0.873335 -0.0776
H  1.909182 1.1409 -1.139059
H  2.693128 1.349646 0.422972
C  0.516384 1.45829 0.509859
C  -0.632681 1.054189 -0.306207
H  0.530865 -1.300428 -1.547927
H  -1.950722 -1.170772 -1.249092
H  0.379964 1.218351 1.567944
H  -0.509309 1.221546 -1.38049
H  -2.786879 1.02946 -0.48322
H  0.607816 2.558179 0.421456
H  -0.333193 -1.243097 1.407416
totalener: -312.29450597 hartree
nucrepener: 381.74697933 hartree
electener: -694.04148530 hartree
oneelecener: -1164.19270930 hartree
twoeener: 470.15122400 hartree
kineticenergy: 310.01392669 hartree
xcener: -23.086268012917 hartree
chargesum: 1.0000000
charge: -0.278853 0.200486 -0.277803 0.190200 -0.126196 -0.119039 -0.308520 0.189314 0.189726 -0.270936 0.180060 0.192516 -0.305322 0.049624 0.223719 0.188362 0.204569 0.243554 0.195143 0.227895 0.211501
charge: 0.087947 0.005698 0.090479 0.000854 0.101065 0.087990 0.070812 0.000414 0.006497 0.103997 -0.005913 0.000951 0.067766 0.328797 -0.010124 0.001278 0.004617 0.014275 0.009329 0.040299 -0.007029
qa: -0.2789 0.2005 -0.2778 0.1902 -0.1262 -0.1190 -0.3085 0.1893 0.1897 -0.2709 0.1801 0.1925 -0.3053 0.0496 0.2237 0.1884 0.2046 0.2436 0.1951 0.2279 0.2115
va: 3.7148 0.9552 3.7602 0.9581 3.6498 3.6339 3.7843 0.9585 0.9601 3.7220 0.9558 0.9514 3.7525 3.4100 0.9438 0.9620 0.9527 0.9366 0.9583 0.9447 0.9527
energy: -312.294505968495
dipole: 0.53154 -0.89259 -0.36105 1.90018 -1.10985 0.79033 0.15189 -0.28967 -0.13778
magnitude: 0.87975 au
magnitude: 2.23616 debye
