program: Orca
programVersion: 5.0.3
elementType: C H C H C C C H H C H H C C H H H H H H H
charge: 1
multiplicity: 1
keywords: m062x def2-TZVP EnGrad RIJCOSX verytightscf def2/J soscf
formula: C8H13
InChI: InChI=1/C8H13/c1-2-4-6-8-7-5-3-1/h1-2,7H,3-6,8H2
21 atoms
C  -1.999609 0.735336 0.077719
H  -2.194599 0.86623 1.145702
C  -1.751206 -0.936823 -0.14645
H  -2.618446 -1.34586 0.377106
C  -0.427402 -1.365785 0.40508
C  0.695277 -1.284459 -0.366015
C  2.007372 -0.687337 0.068179
H  2.220265 -0.878257 1.125691
H  2.858882 -1.024814 -0.527183
C  1.799046 0.891043 -0.144949
H  1.856832 1.131535 -1.211725
H  2.610898 1.423481 0.355202
C  0.423292 1.26152 0.449486
C  -0.752267 1.318819 -0.375626
H  0.530153 -1.212441 -1.445584
H  -1.846309 -1.124723 -1.217463
H  0.105008 0.273201 0.902262
H  -0.622317 1.393872 -1.459255
H  -2.871547 0.987456 -0.526297
H  0.383795 1.835378 1.387576
H  -0.346784 -1.515815 1.483568
totalener: -312.24460811 hartree
nucrepener: 380.82114330 hartree
electener: -693.06575141 hartree
oneelecener: -1162.29298965 hartree
twoeener: 469.22723823 hartree
kineticenergy: 310.36121528 hartree
xcener: -23.091938720280 hartree
chargesum: 1.0000000
charge: -0.319113 0.223857 -0.328997 0.214682 -0.154802 -0.115231 -0.316450 0.202038 0.197024 -0.353993 0.205725 0.199201 -0.193453 0.067093 0.178883 0.218471 0.160028 0.219765 0.214892 0.260089 0.220289
charge: -0.179795 0.166562 -0.156918 0.165444 -0.200319 -0.103399 -0.218256 0.154978 0.154373 -0.206482 0.150738 0.157068 -0.216411 0.079433 0.157892 0.157662 0.246368 0.172632 0.164467 0.194813 0.159151
qa: -0.3191 0.2239 -0.3290 0.2147 -0.1548 -0.1152 -0.3164 0.2020 0.1970 -0.3540 0.2057 0.1992 -0.1935 0.0671 0.1789 0.2185 0.1600 0.2198 0.2149 0.2601 0.2203
va: 3.7270 0.9421 3.7673 0.9496 3.5399 3.7300 3.7209 0.9488 0.9608 3.7671 0.9455 0.9606 3.5625 3.5372 0.9527 0.9408 0.9959 0.9396 0.9547 0.9319 0.9413
energy: -312.244608112123
dipole: 0.06172 -0.70817 -0.64644 0.75891 0.04867 0.80758 0.36535 -0.41517 -0.04982
magnitude: 1.03564 au
magnitude: 2.63239 debye
