program: Orca
programVersion: 5.0.3
elementType: C H C H C C C H H C H H C C H H H H H H H
charge: 1
multiplicity: 1
keywords: m062x cc-pVTZ EnGrad RIJCOSX verytightscf cc-pVTZ/C def2/J soscf
formula: C8H13
InChI: InChI=1/C8H13/c1-2-4-6-8-7-5-3-1/h1-2,7H,3-6,8H2
21 atoms
C  -1.99893 0.519301 0.107632
H  -2.185451 0.735622 1.162888
C  -1.99127 -1.011781 -0.155417
H  -2.681319 -1.602339 0.448129
C  -0.539904 -1.088939 0.27529
C  0.59305 -1.080412 -0.517805
C  1.903071 -0.634699 0.049359
H  1.998509 -0.961264 1.090398
H  2.741062 -1.043819 -0.520979
C  1.925303 0.932339 -0.011103
H  2.095839 1.251727 -1.045565
H  2.757102 1.313151 0.587296
C  0.570104 1.475084 0.481601
C  -0.51046 0.726715 -0.248176
H  0.510446 -1.278231 -1.585862
H  -2.128171 -1.249791 -1.213977
H  0.456622 1.384965 1.567205
H  -0.400958 0.809289 -1.332963
H  -2.67248 1.114639 -0.514801
H  0.480025 2.541338 0.22989
H  -0.381312 -1.04321 1.353474
totalener: -312.31876262 hartree
nucrepener: 387.21814500 hartree
electener: -699.53690762 hartree
oneelecener: -1174.95151390 hartree
twoeener: 475.41460628 hartree
kineticenergy: 310.05079158 hartree
xcener: -23.110519015195 hartree
chargesum: 1.0000000
charge: -0.231885 0.188117 -0.284976 0.188050 -0.069946 -0.017330 -0.313788 0.190232 0.190572 -0.270418 0.184351 0.189695 -0.298188 -0.116216 0.237682 0.188636 0.189948 0.234470 0.187934 0.207898 0.225162
charge: 0.107471 0.000560 0.108518 -0.000409 0.113749 0.181578 0.084610 0.003681 0.007690 0.096787 -0.005110 0.001081 0.065264 0.190372 0.006455 0.000265 -0.001470 0.005984 -0.001093 0.018824 0.015191
qa: -0.2319 0.1881 -0.2850 0.1880 -0.0699 -0.0173 -0.3138 0.1902 0.1906 -0.2704 0.1844 0.1897 -0.2982 -0.1162 0.2377 0.1886 0.1899 0.2345 0.1879 0.2079 0.2252
va: 3.7193 0.9629 3.7501 0.9611 3.6295 3.5749 3.7885 0.9559 0.9607 3.7257 0.9549 0.9540 3.7476 3.5844 0.9344 0.9627 0.9556 0.9425 0.9566 0.9487 0.9478
energy: -312.318762621532
dipole: 0.55281 -0.67780 -0.12499 1.84598 -1.89654 -0.05055 0.21085 -0.38331 -0.17247
magnitude: 0.21891 au
magnitude: 0.55643 debye
