program: Orca
programVersion: 5.0.3
elementType: C H C H C C C H H C H H C C H H H H H H H
charge: 1
multiplicity: 1
keywords: PBE0 def2-TZVP EnGrad RIJCOSX verytightscf def2/J soscf
formula: C8H13
InChI: InChI=1/C8H13/c1-2-4-6-8-7-5-3-1/h1-2,7H,3-6,8H2
21 atoms
C  -1.992145 0.594858 0.086654
H  -2.169817 0.767721 1.15442
C  -1.824091 -0.957262 -0.172548
H  -2.649435 -1.483708 0.315425
C  -0.438737 -1.310247 0.353166
C  0.652091 -1.240618 -0.437149
C  1.947656 -0.698307 0.072268
H  2.116063 -0.943346 1.126022
H  2.815366 -1.03504 -0.505152
C  1.822499 0.849781 -0.102607
H  1.864576 1.108581 -1.166831
H  2.65496 1.363283 0.386721
C  0.48087 1.415081 0.509808
C  -0.688948 1.174377 -0.322497
H  0.524977 -1.261155 -1.521682
H  -1.882465 -1.152738 -1.248133
H  0.331212 1.084936 1.540414
H  -0.594307 1.479776 -1.369577
H  -2.823026 0.994399 -0.503798
H  0.62169 2.515854 0.512401
H  -0.318097 -1.347959 1.436846
totalener: -312.05559625 hartree
nucrepener: 380.20069652 hartree
electener: -692.25629277 hartree
oneelecener: -1161.44929149 hartree
twoeener: 469.19299872 hartree
kineticenergy: 310.15819459 hartree
exchangeener: -34.170292138795 hartree
correlationener: -1.962712066467 hartree
xcener: -36.133004205262 hartree
chargesum: 1.0000000
charge: -0.192461 0.175174 -0.214054 0.175807 -0.147553 -0.114004 -0.217400 0.160517 0.171045 -0.254601 0.159905 0.176298 -0.144927 0.025742 0.157616 0.168213 0.162067 0.203690 0.181200 0.204597 0.163130
charge: -0.201876 0.169366 -0.197104 0.156403 -0.107557 -0.130619 -0.224716 0.156990 0.163145 -0.199084 0.152049 0.157206 -0.218112 0.137180 0.159856 0.158782 0.163832 0.174787 0.166730 0.205295 0.157447
qa: -0.1925 0.1752 -0.2141 0.1758 -0.1476 -0.1140 -0.2174 0.1605 0.1710 -0.2546 0.1599 0.1763 -0.1449 0.0257 0.1576 0.1682 0.1621 0.2037 0.1812 0.2046 0.1631
va: 3.8967 0.9671 3.8971 0.9679 3.9463 3.9067 3.9406 0.9699 0.9700 3.9519 0.9675 0.9620 3.8986 3.7180 0.9647 0.9711 0.9771 0.9441 0.9674 0.9548 0.9637
energy: -312.055596252546
dipole: 0.46068 -0.89514 -0.43446 1.95718 -0.88943 1.06775 0.14699 -0.26983 -0.12284
magnitude: 1.15928 au
magnitude: 2.94665 debye
