program: Gaussian 09
title: 000050869
version: EM64L-G09RevD.01
frameworkgroup: C1[X(C12H20N2O)]
method: RPBEPBE
basis: SDD
operation: Freq
keyword: #p
keyword: freq=noraman
keyword: PBEPBE/SDD
title: #p freq=noraman PBEPBE/SDD
converged: YES YES NO NO
title: Mulliken charges:
elementType: O N N C C C C C C C C C C C C H H H H H H H H H H H H H H H H H H H H
charge: -0.270297 -0.286654 -0.584493 -0.367941 -0.367310 -0.387730 -0.405487 -0.341449 -0.315056 0.368431 -0.351893 -0.381423 -0.223391 -0.197642 -0.258483 0.192197 0.196088 0.188292 0.193019 0.218821 0.175568 0.215837 0.214312 0.172991 0.226396 0.204620 0.206002 0.237763 0.247348 0.249123 0.261179 0.297854 0.221437 0.225690 0.226282
chargesum: 0.00000
title: Mulliken charges with hydrogens summed into heavy atoms:
elementType: O N N C C C C C C C C C C C C
charge: -0.270297 -0.048892 -0.025460 0.020344 0.014001 0.006659 0.024661 0.057938 0.095565 0.368431 -0.104545 -0.132300 -0.001954 0.028049 -0.032201
polarizability: 2.20196133e+02 3.13865097e+00 1.36586984e+02 1.53492926e-01 -3.50314052e-01 9.02722520e+01
1716.lowfreq: -0.0009 0.0005 0.0008 5.9290 6.6170 22.2866 26.2214 35.9809 50.7966
frequency: 22.2783 35.9364 49.7283 57.0462 92.3605 97.2432 103.7689 133.1693 146.8958 158.9206 168.2036 195.4619 233.4363 295.3235 348.8831 366.9903 408.0032 412.8491 439.9281 489.8442 504.2448 512.1659 584.7338 611.1250 692.8549 724.4191 733.1073 757.2554 760.7993 788.5616 809.6996 825.8050 886.5007 893.6530 960.9565 964.1222 981.4984 982.4631 984.9649 1005.3702 1017.3926 1022.8553 1052.3458 1074.9506 1078.4847 1084.1746 1108.2754 1146.0494 1150.6728 1163.4864 1166.6891 1178.0790 1213.9746 1218.8050 1228.2795 1237.3156 1261.4102 1275.9130 1283.2968 1291.8980 1296.1525 1313.5718 1327.9329 1357.3312 1368.2152 1377.4365 1392.7130 1443.7881 1465.8227 1467.1970 1468.1121 1471.1367 1476.5118 1484.1804 1492.4355 1496.6176 1591.1633 1612.9400 1647.5610 2862.8251 2942.9331 2952.6145 2955.7972 2966.0020 2994.5439 2995.3601 2999.6492 3015.2307 3033.9381 3052.8505 3063.4183 3126.3283 3134.9601 3154.7588 3163.4660 3172.0391 3325.5524 3407.3379 3594.9106
redmass: 4.5559 4.6455 2.7718 2.5688 3.0163 4.3184 1.8615 2.6133 1.8588 2.2177 5.7252 3.9359 5.0317 3.0096 2.2302 1.9897 1.6565 2.9388 1.9923 4.0277 2.8545 3.0493 5.8874 6.4241 2.0285 1.3821 1.0972 1.4131 1.2459 6.2381 1.1683 1.2347 1.3405 1.3074 1.3605 6.6219 1.3351 1.7940 2.6659 2.9833 3.8689 2.0528 2.6800 2.5126 2.1588 1.6023 3.3145 1.5201 2.3867 1.4771 1.0840 1.1751 1.4389 3.3395 1.2869 1.5319 1.2346 1.1515 1.1926 1.1030 1.1273 1.3410 1.3304 1.5097 1.5666 2.0202 3.0463 2.3840 1.0932 1.0798 1.1121 1.2009 1.4175 1.2432 1.1684 1.0921 6.4158 6.2417 1.0873 1.0719 1.0550 1.0639 1.0589 1.0603 1.0758 1.0803 1.1059 1.0974 1.0961 1.0961 1.1046 1.0846 1.0891 1.0926 1.0950 1.1003 1.0743 1.0477 1.0960
irintensity: 0.2358 0.0245 2.3970 2.4299 4.2503 0.1200 2.7753 2.3257 1.0565 2.6961 0.4741 3.6652 0.5897 10.4553 26.1763 48.6806 137.5382 0.0902 65.2985 0.9844 12.2399 11.3154 4.0842 0.5330 35.5350 76.3021 25.6882 54.9948 34.9937 20.7636 0.0979 0.6305 4.9004 3.3607 0.2357 48.5146 0.5728 0.4965 9.9460 19.0631 0.0576 23.1815 3.0005 11.7186 1.2797 13.0598 0.0132 0.5125 5.1111 2.1342 11.5846 48.4014 0.7471 241.8255 12.9443 5.2617 0.2145 0.0570 1.0150 1.0733 0.2085 0.8353 0.5513 0.4171 6.1636 6.7799 29.3808 2.2549 2.4479 0.6225 10.9316 38.2899 66.7395 23.7917 3.7728 9.5434 24.1338 85.8241 5.9295 101.6854 27.7662 12.2655 8.8954 79.3242 15.0656 26.2504 27.2698 7.9092 19.0938 46.7612 122.1325 3.1149 13.4020 35.0631 24.1912 5.1087 24.8451 27.0876 2.8528
temp: 298.150 k
press: 1.00000 atm
elementType: 8 7 7 6 6 6 6 6 6 6 6 6 6 6 6 1 1 1 1 1 1 1 1 1 1 1 1 1 1 1 1 1 1 1 1
symmnumber: 1
zpe: 795159.3 jmol-1
zpe.correction: 0.302860 hartree
zpe.thermalcorrener: 0.319573 hartree
zpe.thermalcorrenthalpy: 0.320517 hartree
zpe.thermalcorrgfe: 0.256365 hartree
zpe.sumelectzpe: -652.768786 hartree
zpe.sumelectthermal: -652.752073 hartree
zpe.sumelectthermalent: -652.751129 hartree
zpe.sumelectthermalfe: -652.815282 hartree
dipole: -1.7896 1.5647 1.5423
dipole: 2.8337
quadrupole: -80.3949 -89.5145 -94.1455
quadrupole: -1.4858 -10.9181 0.5456
quadrupole: 7.6234 -1.4962 -6.1272 -1.4858 -10.9181 0.5456
hfenergy: -653.0716466 hartree
pointgroup: C01 [X(C12H20N2O1)]
dipole: 0.6945615 0.544778 -0.680978 debye
polarizability: 220.1871911|-3.1413447|136.0930297|-1.2889653|-4.7178969|90.7751482 unknown
InChI: InChI=1S/C12H20N2O/c13-14-10-6-1-2-7-11-15-12-8-4-3-5-9-12/h3-5,8-9,14H,1-2,6-7,10-11,13H2
charge 0 multiplicity 1
35 atoms
O  -1.925436 -0.756606 0.093443
N  6.778146 0.570936 -0.142459
N  8.036321 -0.082355 -0.006938
C  3.05302 -0.455449 -0.005423
C  1.726694 0.335671 -0.062739
C  4.300714 0.451175 -0.094382
C  0.484033 -0.578531 0.036147
C  5.61924 -0.344287 -0.022466
C  -0.822727 0.214953 -0.026968
C  -3.240784 -0.265692 0.069101
C  -3.584456 1.102601 -0.074732
C  -4.256506 -1.246491 0.201832
C  -4.949345 1.475757 -0.084235
C  -5.61005 -0.85801 0.190874
C  -5.967092 0.506298 0.047654
H  3.07265 -1.196517 -0.831258
H  3.089719 -1.038819 0.937655
H  1.6893 0.916583 -1.008288
H  1.710379 1.07833 0.761961
H  4.292729 1.194023 0.726717
H  4.263508 1.027581 -1.044526
H  0.509062 -1.149432 0.984136
H  0.49224 -1.319929 -0.785723
H  5.616936 -1.139871 -0.810276
H  5.709459 -0.857695 0.951155
H  -0.91001 0.761328 -0.9900
H  -0.881767 0.950176 0.803315
H  6.70422 1.162301 -0.988879
H  -2.813649 1.872031 -0.177976
H  -3.961326 -2.294615 0.3123
H  8.42868 -0.556315 -0.830313
H  8.70463 0.436813 0.562319
H  -5.212204 2.534016 -0.196052
H  -6.389559 -1.62123 0.294878
H  -7.020569 0.804971 0.039648
