program: Orca
programVersion: 5.0.3
elementType: C H C H C C C H H C H H C C H H H H H H H
charge: 1
multiplicity: 1
keywords: b3lyp cc-pVTZ EnGrad RIJCOSX verytightscf cc-pVTZ/C def2/J soscf
formula: C8H13
InChI: InChI=1/C8H13/c1-2-4-6-8-7-5-3-1/h1-2,7H,3-6,8H2
21 atoms
C  -1.991619 0.590989 0.088068
H  -2.169156 0.765253 1.155524
C  -1.828338 -0.958676 -0.172799
H  -2.65079 -1.488194 0.316629
C  -0.441167 -1.30616 0.351028
C  0.650468 -1.237989 -0.439544
C  1.945431 -0.697082 0.072393
H  2.111469 -0.943655 1.126181
H  2.813346 -1.035306 -0.503783
C  1.82421 0.851541 -0.100849
H  1.867491 1.110725 -1.164976
H  2.658257 1.362185 0.388805
C  0.483966 1.419343 0.510301
C  -0.684413 1.166089 -0.321457
H  0.525492 -1.2655 -1.524017
H  -1.887479 -1.154435 -1.248318
H  0.335663 1.096117 1.543375
H  -0.587903 1.46199 -1.37108
H  -2.820119 0.996253 -0.502118
H  0.622373 2.520184 0.505548
H  -0.319099 -1.339679 1.434744
totalener: -312.22722405 hartree
nucrepener: 380.29593856 hartree
electener: -692.52316260 hartree
oneelecener: -1161.61704543 hartree
twoeener: 469.09388282 hartree
kineticenergy: 309.97318726 hartree
exchangeener: -36.300794663977 hartree
correlationener: -2.304139515539 hartree
xcener: -38.604934179516 hartree
chargesum: 1.0000000
charge: -0.164304 0.151334 -0.171347 0.152408 -0.101301 -0.113720 -0.173651 0.133676 0.151360 -0.186546 0.131223 0.153771 -0.162790 0.058947 0.158614 0.139872 0.141305 0.204284 0.160276 0.182558 0.154030
charge: 0.096537 0.007974 0.099144 -0.001583 0.093051 0.070400 0.076529 -0.002700 0.005047 0.116622 -0.008874 -0.001458 0.077448 0.338131 -0.016066 -0.001291 0.002917 0.013777 0.008303 0.042429 -0.016337
qa: -0.1643 0.1513 -0.1713 0.1524 -0.1013 -0.1137 -0.1737 0.1337 0.1514 -0.1865 0.1312 0.1538 -0.1628 0.0589 0.1586 0.1399 0.1413 0.2043 0.1603 0.1826 0.1540
va: 3.8103 0.9872 3.8532 0.9809 3.7945 3.8040 3.8633 0.9923 0.9831 3.8280 0.9895 0.9798 3.8551 3.5328 0.9880 0.9905 0.9951 0.9705 0.9827 0.9739 0.9938
energy: -312.227224045755
dipole: 0.46804 -0.88403 -0.41599 1.95280 -0.94072 1.01208 0.14647 -0.26816 -0.12169
magnitude: 1.10098 au
magnitude: 2.79847 debye
