program: Orca
programVersion: 5.0.3
elementType: C H C H C C C H H C H H C C H H H H H H H
charge: 1
multiplicity: 1
keywords: DSD-PBEP86 cc-pVTZ EnGrad D3BJ RIJCOSX verytightscf cc-pVTZ/C def2/J soscf
formula: C8H13
InChI: InChI=1/C8H13/c1-2-4-6-8-7-5-3-1/h1-2,7H,3-6,8H2
21 atoms
C  -1.998823 0.759882 0.070097
H  -2.162407 0.831319 1.148069
C  -1.730077 -0.966628 -0.158198
H  -2.618389 -1.317776 0.371101
C  -0.416526 -1.386741 0.393002
C  0.68618 -1.27636 -0.377526
C  2.001413 -0.69183 0.062897
H  2.209523 -0.889387 1.120035
H  2.855864 -1.034151 -0.526869
C  1.78916 0.858004 -0.140365
H  1.830832 1.118468 -1.203623
H  2.59301 1.406508 0.357579
C  0.421924 1.261533 0.488959
C  -0.767777 1.301036 -0.373424
H  0.521648 -1.20174 -1.457183
H  -1.834153 -1.126926 -1.231714
H  0.188852 0.58111 1.313954
H  -0.659063 1.588678 -1.422817
H  -2.882524 0.991684 -0.522719
H  0.468109 2.247142 0.997338
H  -0.335232 -1.487251 1.474839
totalener: -311.09983320 hartree
nucrepener: 379.49341122 hartree
electener: -690.59324442 hartree
oneelecener: -1159.38735149 hartree
twoeener: 468.79410707 hartree
kineticenergy: 309.72883762 hartree
exchangeener: -13.661710805303 hartree
correlationener: -0.921349928128 hartree
xcener: -14.583060733431 hartree
chargesum: 1.0000000
charge: -0.265047 0.200326 -0.239366 0.200750 -0.150477 -0.125124 -0.236018 0.156276 0.174064 -0.258846 0.159085 0.177366 -0.245895 0.103046 0.164041 0.191454 0.155622 0.233334 0.203372 0.217498 0.184540
charge: 0.133048 0.013970 0.177678 0.007524 0.019913 0.068975 0.075246 -0.004864 -0.003517 0.104927 -0.012568 -0.001693 0.075877 0.311022 -0.017274 -0.000838 0.006895 0.017993 0.006247 0.042893 -0.021454
qa: -0.2650 0.2003 -0.2394 0.2008 -0.1505 -0.1251 -0.2360 0.1563 0.1741 -0.2588 0.1591 0.1774 -0.2459 0.1030 0.1640 0.1915 0.1556 0.2333 0.2034 0.2175 0.1845
va: 3.8867 0.9709 3.9076 0.9650 3.8233 3.8453 3.9064 0.9870 0.9773 3.8888 0.9843 0.9753 3.8958 3.5548 0.9834 0.9718 1.0034 0.9578 0.9720 0.9624 0.9818
dispcorr: -0.011906050 hartree
energy: -311.805189380884
dipole: 0.16485 -1.08961 -0.92476 1.59914 -0.49170 1.10744 0.39145 -0.51633 -0.12488
magnitude: 1.44817 au
magnitude: 3.68095 debye
