program: Orca
programVersion: 5.0.3
elementType: C H C H C C C H H C H H C C H H H H H H H
charge: 1
multiplicity: 1
keywords: PBE0 def2-TZVP EnGrad D3BJ RIJCOSX verytightscf def2/J soscf
formula: C8H13
InChI: InChI=1/C8H13/c1-2-4-6-8-7-5-3-1/h1-2,7H,3-6,8H2
21 atoms
C  -1.990782 0.556493 0.107938
H  -2.16661 0.740522 1.17234
C  -1.882965 -0.9760 -0.174878
H  -2.665509 -1.537714 0.341289
C  -0.473531 -1.246132 0.319983
C  0.631481 -1.195647 -0.470835
C  1.922378 -0.678925 0.07204
H  2.056743 -0.947877 1.125093
H  2.790331 -1.038788 -0.489238
C  1.849193 0.877006 -0.07356
H  1.917483 1.146431 -1.134312
H  2.698287 1.347633 0.430076
C  0.520982 1.462799 0.508768
C  -0.624517 1.033854 -0.303024
H  0.531593 -1.303441 -1.55127
H  -1.961536 -1.173004 -1.248844
H  0.38619 1.235923 1.570096
H  -0.497462 1.181549 -1.379588
H  -2.781279 1.036046 -0.480754
H  0.602328 2.561963 0.407329
H  -0.335865 -1.227582 1.402714
totalener: -312.06849688 hartree
nucrepener: 382.04193197 hartree
electener: -694.11042885 hartree
oneelecener: -1165.08200765 hartree
twoeener: 470.97157879 hartree
kineticenergy: 310.15989800 hartree
exchangeener: -34.175284118805 hartree
correlationener: -1.966430451138 hartree
xcener: -36.141714569943 hartree
chargesum: 1.0000000
charge: -0.193841 0.167298 -0.206234 0.175776 -0.102450 -0.099205 -0.221483 0.160510 0.173594 -0.247068 0.158186 0.176656 -0.162156 -0.017388 0.174939 0.163406 0.158789 0.196488 0.179476 0.199112 0.165596
charge: -0.208118 0.162129 -0.202844 0.155649 -0.074536 -0.096397 -0.222045 0.158411 0.163756 -0.207563 0.153007 0.157186 -0.226546 0.104356 0.163036 0.158693 0.161249 0.173729 0.164889 0.197513 0.164445
qa: -0.1938 0.1673 -0.2062 0.1758 -0.1025 -0.0992 -0.2215 0.1605 0.1736 -0.2471 0.1582 0.1767 -0.1622 -0.0174 0.1749 0.1634 0.1588 0.1965 0.1795 0.1991 0.1656
va: 3.9059 0.9713 3.8980 0.9696 3.9361 3.9176 3.9518 0.9694 0.9693 3.9421 0.9689 0.9625 3.9329 3.7856 0.9601 0.9736 0.9735 0.9469 0.9682 0.9583 0.9634
dispcorr: -0.018917000 hartree
energy: -312.087413880223
dipole: 0.53854 -0.84233 -0.30380 1.89250 -1.24501 0.64748 0.15437 -0.27923 -0.12486
magnitude: 0.72603 au
magnitude: 1.84542 debye
