program: Gaussian 09
title: 000050863
version: EM64L-G09RevD.01
frameworkgroup: C1[X(C11H18N2O)]
method: RPBEPBE
basis: SDD
operation: Freq
keyword: #p
keyword: freq=noraman
keyword: PBEPBE/SDD
title: #p freq=noraman PBEPBE/SDD
converged: YES YES NO NO
title: Mulliken charges:
elementType: O N N C C C C C C C C C C C H H H H H H H H H H H H H H H H H H
charge: -0.273628 -0.343885 -0.590583 -0.062368 -0.325678 -0.384440 -0.383782 -0.700481 0.378358 -0.348333 -0.386448 -0.224930 -0.197905 -0.258252 0.208863 0.219104 0.208538 0.239259 0.190304 0.220907 0.198947 0.242643 0.208542 0.211334 0.209438 0.268870 0.300710 0.250989 0.249002 0.221996 0.226115 0.226794
chargesum: 0.00000
title: Mulliken charges with hydrogens summed into heavy atoms:
elementType: O N N C C C C C C C C C C C
charge: -0.273628 -0.101242 -0.021003 0.146496 0.101964 0.035414 0.045780 -0.071167 0.378358 -0.097344 -0.137446 -0.002933 0.028210 -0.031458
polarizability: 1.84150181e+02 1.06691931e+01 1.07664477e+02 5.11986436e+00 -1.43744610e+01 1.16528905e+02
1716.lowfreq: -3.3366 -0.0009 -0.0008 -0.0006 4.2498 15.7291 22.3815 34.3765 53.4847
frequency: 22.2397 33.8432 53.4333 60.9764 80.8364 99.3133 158.4771 205.8111 228.0444 231.9434 235.1520 250.5443 316.2666 333.7246 345.9214 386.8892 412.0425 458.3453 503.5612 523.0306 586.6668 610.4488 613.4289 692.1404 715.0655 748.6739 758.4507 793.8417 822.9595 829.2860 868.3412 888.6385 921.0790 960.4287 973.6684 981.0293 983.2874 994.8191 1022.6129 1025.7566 1054.8513 1082.2681 1101.0682 1134.1156 1158.4554 1166.3278 1169.7236 1178.5971 1204.8966 1219.0811 1222.1443 1249.0448 1291.6600 1292.7845 1311.8113 1313.4208 1338.3056 1370.2352 1379.1922 1387.4690 1395.1504 1443.4403 1447.2485 1471.2427 1475.1068 1477.4396 1482.6255 1486.4146 1489.8990 1591.0027 1612.2438 1646.9756 2881.9601 2933.7305 2968.3696 2972.6570 2995.6529 3024.6787 3028.9920 3053.7799 3067.2483 3070.1688 3127.0523 3135.8225 3154.8625 3163.5054 3172.2638 3327.1442 3424.9148 3605.6932
redmass: 3.5422 4.1131 2.3093 2.5507 3.8283 4.0793 2.3018 2.9844 2.9071 2.1029 2.7386 1.8331 2.7444 1.9682 1.4602 1.4216 2.9321 3.6083 2.8545 4.1069 4.2527 5.9782 2.2210 2.0375 1.5054 1.3692 1.6518 4.0879 1.2967 2.2664 1.3671 1.4609 1.9269 1.3660 3.6743 1.3252 3.5028 2.9175 2.0175 1.5867 2.8867 1.5238 1.9974 1.9963 1.8626 1.1715 1.7589 1.2120 1.2132 1.7217 3.4420 1.3389 1.1865 1.3286 1.2024 1.3349 1.4951 1.3996 2.1792 1.3292 2.2574 2.3625 1.0821 1.4586 1.0693 1.0704 1.3734 1.0813 1.2092 6.4328 6.2338 1.0869 1.0817 1.0638 1.0358 1.0615 1.0602 1.0968 1.0966 1.1017 1.0992 1.1017 1.0847 1.0891 1.0925 1.0952 1.1004 1.0741 1.0469 1.0975
irintensity: 0.0865 0.6362 1.3126 0.9546 0.3079 2.9954 7.6521 2.9947 2.1542 0.5689 0.1931 1.1025 14.2091 15.3416 90.4308 170.5690 0.0756 2.8396 12.2233 4.1874 10.5943 0.2821 9.5633 32.0798 47.3157 30.9919 91.1681 20.0761 0.6090 2.6496 6.0433 9.3781 3.3536 0.2989 20.9412 0.4596 1.2299 34.5836 16.9105 16.0724 0.0416 14.6277 5.5041 6.7167 3.9379 12.6571 4.4558 29.9522 0.3928 3.2258 235.3823 2.3467 0.9962 7.6237 4.0528 0.9899 3.9139 0.3491 5.4525 9.0860 8.6900 3.0057 13.5059 103.5721 3.7467 32.1385 23.2034 9.7413 2.6499 24.8116 86.0544 8.7852 70.0653 55.3057 52.6428 17.8865 35.9018 6.6043 35.7493 3.4350 54.1883 96.0162 2.9011 13.1317 34.1923 21.9943 5.3865 25.1127 15.5773 4.4344
temp: 298.150 k
press: 1.00000 atm
elementType: 8 7 7 6 6 6 6 6 6 6 6 6 6 6 1 1 1 1 1 1 1 1 1 1 1 1 1 1 1 1 1 1
symmnumber: 1
zpe: 720652.9 jmol-1
zpe.correction: 0.274482 hartree
zpe.thermalcorrener: 0.289801 hartree
zpe.thermalcorrenthalpy: 0.290746 hartree
zpe.thermalcorrgfe: 0.230189 hartree
zpe.sumelectzpe: -613.546369 hartree
zpe.sumelectthermal: -613.531049 hartree
zpe.sumelectthermalent: -613.530105 hartree
zpe.sumelectthermalfe: -613.590662 hartree
dipole: -0.9277 -2.4007 0.5097
dipole: 2.6237
quadrupole: -77.1198 -80.7818 -83.8083
quadrupole: 8.8308 1.4542 -2.5444
quadrupole: 3.4501 -0.2119 -3.2383 8.8308 1.4542 -2.5444
hfenergy: -613.8208508 hartree
pointgroup: C01 [X(C11H18N2O1)]
dipole: 0.4401111 -0.9175865 -0.1727952 debye
polarizability: 185.5135392|-3.7101265|107.5690372|2.8601681|15.1640505|115.260987 unknown
InChI: InChI=1S/C11H18N2O/c1-2-6-10(13-12)9-14-11-7-4-3-5-8-11/h3-5,7-8,10,13H,2,6,9,12H2,1H3
charge 0 multiplicity 1
32 atoms
O  -0.376668 -0.152402 0.708251
N  2.971649 -1.380484 -0.269906
N  4.291078 -1.36496 0.252564
C  1.995363 -0.552419 0.49779
C  2.423696 0.931364 0.539143
C  2.503077 1.637846 -0.833093
C  0.62556 -0.774468 -0.167788
C  3.125879 3.046135 -0.718836
C  -1.723259 -0.22155 0.316336
C  -2.182846 -0.857166 -0.864681
C  -2.643383 0.398712 1.198929
C  -3.568528 -0.865014 -1.150855
C  -4.01926 0.381801 0.898936
C  -4.492546 -0.250586 -0.278003
H  1.90416 -0.90372 1.55538
H  3.421833 0.961664 1.016236
H  1.718674 1.470396 1.201201
H  0.598686 -0.317805 -1.175614
H  0.407651 -1.861748 -0.263818
H  3.100188 1.012164 -1.523612
H  1.491017 1.728098 -1.27618
H  2.607176 -2.334133 -0.437091
H  4.155867 2.989992 -0.318017
H  3.170917 3.551633 -1.701452
H  2.536475 3.687291 -0.035793
H  4.511942 -1.987942 1.037935
H  5.017393 -1.25838 -0.454287
H  -1.48495 -1.337241 -1.556837
H  -2.259276 0.881924 2.102747
H  -3.921708 -1.356159 -2.064882
H  -4.72521 0.863355 1.584942
H  -5.563047 -0.261798 -0.508047
