program: Gaussian 09
title: 000050999
version: EM64L-G09RevD.01
frameworkgroup: C1[X(C23H26N2O3)]
method: RPBEPBE
basis: SDD
operation: Freq
keyword: #p
keyword: freq=noraman
keyword: PBEPBE/SDD
title: #p freq=noraman PBEPBE/SDD
converged: YES YES NO NO
title: Mulliken charges:
elementType: O O O N N C C C C C C C C C C C C C C C C C C C C C C C H H H H H H H H H H H H H H H H H H H H H H H H H H
charge: -0.276417 -0.265228 -0.254217 -0.092537 -0.060689 -0.338125 -0.352138 -0.388989 -0.390758 -0.469471 0.221930 -0.613299 0.080020 0.173396 0.221581 -0.384437 -0.418572 0.012982 0.169796 0.116970 0.270948 -0.827041 -0.536306 -0.372247 -0.382321 -0.236731 -0.245164 -0.243940 0.191458 0.213992 0.202870 0.195327 0.187714 0.205215 0.206937 0.181692 0.234613 0.219551 0.221367 0.222738 0.187561 0.244029 0.280816 0.276065 0.231636 0.237707 0.226543 0.225224 0.248249 0.294424 0.256641 0.227461 0.230164 0.231009
chargesum: 0.00000
title: Mulliken charges with hydrogens summed into heavy atoms:
elementType: O O O N N C C C C C C C C C C C C C C C C C C C C C C C
charge: -0.276417 -0.265228 -0.254217 -0.092537 -0.060689 0.067325 0.046059 0.003940 -0.002129 -0.015307 0.221930 0.018367 0.080020 0.173396 0.221581 -0.140408 -0.137756 0.012982 0.169796 0.116970 0.270948 -0.081632 0.163710 -0.077823 -0.125680 -0.009270 -0.015001 -0.012930
polarizability: 3.55725165e+02 -3.17717241e+01 3.40474436e+02 -6.37506300e+00 -3.37493384e+01 1.75678069e+02
1716.lowfreq: -3.8039 -0.0007 -0.0004 0.0002 4.0645 7.0216 24.1167 26.2827 46.0567
frequency: 23.9500 26.1559 45.9941 50.2748 58.0278 68.3399 76.2414 89.3654 97.6031 113.1835 134.4067 167.9747 186.4321 195.4871 205.6346 226.5903 229.3167 240.0508 252.6996 276.0986 280.3045 287.4295 294.5244 308.7339 323.0448 340.1520 344.8517 357.3968 358.5236 367.7278 393.8629 409.9674 430.6269 465.2165 472.0376 484.2949 513.6071 556.5381 574.9416 602.5588 610.3731 612.9401 613.1403 635.4033 641.9547 663.2568 705.5103 713.0866 725.7481 751.0050 769.6158 779.6035 790.7547 799.9799 827.1607 848.9985 861.6377 871.9258 919.9551 937.6180 942.1158 974.6490 975.9244 986.3699 987.6416 990.2993 1004.1244 1006.5257 1016.6216 1025.1316 1037.5349 1041.2230 1050.5885 1057.6179 1074.5298 1080.4232 1089.4318 1108.8535 1112.9116 1118.0199 1133.4206 1144.7103 1147.9850 1150.6326 1174.8966 1180.5147 1191.5022 1195.8669 1199.8343 1210.1022 1217.9914 1248.4063 1257.9222 1273.7060 1277.8282 1290.9625 1302.9785 1325.7036 1333.1246 1345.3626 1355.4095 1364.4774 1372.8602 1380.6055 1390.3721 1398.5491 1399.2411 1426.2248 1428.7693 1434.8561 1440.3081 1451.4386 1452.5253 1457.3581 1457.9155 1460.1587 1469.4910 1469.7419 1470.8049 1474.0334 1478.0674 1480.9591 1483.3177 1486.9482 1541.2880 1571.9056 1582.2140 1602.5463 1611.9529 1620.8235 2826.8268 2847.2761 2861.1654 2864.2080 2879.3881 2925.0751 2967.4665 2980.1816 3016.4971 3020.6935 3022.8056 3024.5663 3028.2234 3043.8932 3059.2023 3062.3173 3075.1133 3102.6995 3122.7098 3128.4514 3132.8025 3142.7739 3152.8790 3158.1650 3173.9221 3175.6016
redmass: 4.8484 4.6734 3.2384 3.3752 4.0642 3.9586 4.0954 4.4685 4.2651 4.9012 4.5514 4.0158 3.7181 1.7153 2.0984 1.3963 1.2555 2.1840 2.6384 3.4182 2.1409 3.6877 3.2425 4.6158 2.4721 3.7292 3.6839 3.0507 3.2069 4.9603 1.9814 2.8852 4.4263 4.2299 6.1056 3.3039 4.0289 4.6967 5.7256 5.3365 5.2491 3.4120 4.5481 5.0133 5.2984 5.0612 1.8145 4.8561 5.1189 3.8524 3.2995 2.0414 4.0702 5.0093 1.7035 1.5239 1.2406 3.5588 2.9779 2.5058 1.6516 1.7533 1.7544 3.8493 1.8531 2.5102 2.4614 1.3390 2.6731 2.9854 2.1679 1.4985 1.6252 2.2150 1.7065 1.7496 1.7771 2.1384 1.2613 3.5235 1.9176 2.1049 1.8451 2.8827 1.0560 1.4586 1.1479 1.9201 1.2444 1.9942 2.2031 5.7792 2.0200 2.2799 1.7151 1.4755 1.3089 1.4623 1.2968 1.3333 3.6370 1.4559 1.4515 6.8236 1.6079 2.7167 1.6450 2.8691 1.1727 2.2963 1.3690 1.0792 1.0812 1.0967 1.0860 1.0836 1.0640 1.1274 1.1516 1.1199 1.2593 1.0544 1.8229 2.1766 9.2928 7.3071 6.0894 8.1886 5.9666 7.7259 1.0698 1.0640 1.0641 1.0688 1.0684 1.0666 1.0325 1.0399 1.0726 1.0906 1.0916 1.0874 1.0895 1.0891 1.1043 1.0926 1.1010 1.1004 1.0862 1.1001 1.0893 1.0946 1.0879 1.0976 1.0957 1.0970
irintensity: 0.7011 0.3041 0.7423 1.3528 0.2518 1.2398 1.7214 0.3276 0.4087 5.6708 6.1708 1.3186 0.3641 0.0894 1.6112 0.8535 0.4148 1.4196 0.4142 0.4089 3.1099 0.1949 0.6465 2.2254 12.9487 2.5993 0.2226 1.7960 5.1811 3.3803 0.3537 0.1889 2.1835 6.0299 7.5422 0.8229 8.2868 7.2643 3.5463 4.4089 2.4006 0.4385 1.6861 6.9677 2.3525 6.1822 43.0335 6.5376 22.6481 7.1418 35.4338 30.2189 12.1086 12.5437 24.0938 0.0095 1.4697 3.2004 4.3090 5.2292 5.3131 4.2198 5.0151 0.8151 1.4833 0.8025 56.9253 2.9018 6.8791 2.7728 14.8540 4.9309 3.2252 96.2601 19.9407 11.0370 88.9258 19.5140 0.4566 137.3388 5.8383 3.6191 21.5541 42.7528 0.0764 29.9722 5.2909 59.5455 16.9682 1.3433 11.4175 121.3232 5.8716 1.2890 15.9898 47.6126 1.2249 30.0693 13.0237 8.8505 253.0175 5.9280 5.2045 28.3634 7.0205 108.3094 10.2425 29.8342 0.4367 23.2942 7.2110 0.2518 0.1866 17.1842 41.3213 11.0786 4.5813 67.9091 30.4463 5.3541 2.7763 7.4589 8.2086 1.3189 199.0115 8.8388 11.1980 153.1210 40.2914 155.9684 85.0427 53.3987 76.4201 107.3944 190.5217 71.5691 81.3620 25.0777 50.7415 26.0848 8.7852 92.9622 40.8165 25.3122 39.6608 14.8454 32.5962 5.4942 6.8632 19.9716 8.2651 6.1142 0.6960 37.8308 14.7565 16.4481
temp: 298.150 k
press: 1.00000 atm
elementType: 8 8 8 7 7 6 6 6 6 6 6 6 6 6 6 6 6 6 6 6 6 6 6 6 6 6 6 6 1 1 1 1 1 1 1 1 1 1 1 1 1 1 1 1 1 1 1 1 1 1 1 1 1 1
symmnumber: 1
zpe: 1160999.1 jmol-1
zpe.correction: 0.442201 hartree
zpe.thermalcorrener: 0.467913 hartree
zpe.thermalcorrenthalpy: 0.468857 hartree
zpe.thermalcorrgfe: 0.386262 hartree
zpe.sumelectzpe: -1225.140049 hartree
zpe.sumelectthermal: -1225.114338 hartree
zpe.sumelectthermalent: -1225.113394 hartree
zpe.sumelectthermalfe: -1225.195988 hartree
dipole: 2.5966 2.5072 -1.2927
dipole: 3.8340
quadrupole: -139.9203 -165.8233 -168.1259
quadrupole: -24.4895 4.9958 6.6673
quadrupole: 18.0362 -7.8668 -10.1694 -24.4895 4.9958 6.6673
hfenergy: -1225.5822503 hartree
pointgroup: C01 [X(C23H26N2O3)]
dipole: 0.0737173 -1.4600829 0.3714732 debye
polarizability: 379.0566355|-4.5251569|320.1193167|-24.6646854|-15.1720346|172.7017172 unknown
InChI: InChI=1S/C23H26N2O3/c1-16-21(26)18-9-10-20(27-3)19(15-25-13-11-24(2)12-14-25)23(18)28-22(16)17-7-5-4-6-8-17/h4-10H,11-15H2,1-3H3
charge 0 multiplicity 1
54 atoms
O  -0.24867 0.892232 0.70474
O  3.926839 -1.410316 0.836542
O  1.420588 4.345726 -0.88865
N  0.247344 -2.158548 0.335216
N  -0.833445 -4.376626 -1.183759
C  0.993766 -2.739584 -0.808929
C  -0.586111 -3.200652 0.986106
C  0.010571 -3.34001 -1.825711
C  -1.566381 -3.810461 -0.029284
C  1.129785 -1.476488 1.327641
C  1.838105 -0.260788 0.755152
C  -1.727156 -5.051741 -2.142699
C  1.123384 0.921234 0.444834
C  3.239142 -0.229386 0.525635
C  1.727487 2.091728 -0.079991
C  3.884737 0.9331 0.00726
C  3.12826 2.073709 -0.291601
C  0.904753 3.276367 -0.409985
C  -1.074989 1.980712 0.356652
C  -0.557191 3.144355 -0.192168
C  -2.486555 1.61493 0.622111
C  -1.403971 4.31075 -0.651903
C  5.37929 -1.44052 0.637311
C  -2.870427 0.247598 0.498018
C  -3.462604 2.571125 1.014748
C  -4.204667 -0.140657 0.733371
C  -4.794984 2.173666 1.255726
C  -5.174144 0.819411 1.109369
H  1.702902 -3.536312 -0.471851
H  1.581919 -1.939786 -1.293446
H  -1.155369 -2.734336 1.812762
H  0.041859 -4.021629 1.416367
H  -0.611929 -2.512922 -2.254822
H  0.575624 -3.808369 -2.653601
H  -2.145115 -4.619153 0.456036
H  -2.289843 -3.015209 -0.353106
H  1.892156 -2.172776 1.744408
H  0.476003 -1.146462 2.156988
H  -2.282279 -5.858502 -1.630588
H  -1.128172 -5.508167 -2.951205
H  -2.474367 -4.362328 -2.613161
H  4.964507 0.941091 -0.162917
H  3.59094 2.978914 -0.697634
H  -0.853621 4.847044 -1.443119
H  -1.568728 5.043651 0.161253
H  -2.387987 3.990241 -1.032608
H  5.886361 -0.681063 1.262404
H  5.642594 -1.286422 -0.426466
H  5.686856 -2.447833 0.953394
H  -2.111625 -0.491724 0.2164
H  -3.178504 3.616213 1.162991
H  -4.489712 -1.19325 0.623117
H  -5.534501 2.920183 1.565498
H  -6.210526 0.514842 1.293251
