program: Orca
programVersion: 5.0.3
elementType: C H C H C C C H H C H H C C H H H H H H H
charge: 1
multiplicity: 1
keywords: DSD-PBEP86 def2-TZVP D3BJ RIJCOSX verytightscf def2-TZVP/C def2/J soscf noTRAH
formula: C8H13
InChI: InChI=1/C8H13/c1-2-4-6-8-7-5-3-1/h1-2,7H,3-6,8H2
21 atoms
C  -1.993575 0.517628 0.081752
H  -2.19156 0.771242 1.126454
C  -1.999331 -1.020671 -0.130344
H  -2.68253 -1.586029 0.504054
C  -0.543853 -1.087089 0.28625
C  0.576355 -1.061847 -0.526112
C  1.900809 -0.628689 0.026065
H  2.013568 -0.987913 1.054619
H  2.723826 -1.0304 -0.570456
C  1.935416 0.938196 0.013153
H  2.133881 1.287533 -1.006274
H  2.752998 1.296329 0.644022
C  0.569886 1.471017 0.487039
C  -0.4948 0.709886 -0.258055
H  0.478851 -1.270649 -1.590526
H  -2.151511 -1.296726 -1.177335
H  0.441201 1.376876 1.570711
H  -0.376144 0.802088 -1.341069
H  -2.653109 1.098123 -0.568552
H  0.471702 2.536504 0.237398
H  -0.370664 -1.034794 1.361771
totalener: -311.15899437 hartree
nucrepener: 387.49965621 hartree
electener: -698.65865058 hartree
oneelecener: -1175.20681919 hartree
twoeener: 476.54816860 hartree
kineticenergy: 310.04767946 hartree
exchangeener: -13.679584636703 hartree
correlationener: -0.928494276329 hartree
xcener: -14.608078913032 hartree
chargesum: 1.0000000
charge: -0.196076 0.163525 -0.193002 0.177493 -0.056820 -0.037858 -0.223973 0.159611 0.176426 -0.237713 0.152168 0.170447 -0.214633 -0.051324 0.211133 0.159014 0.144897 0.168275 0.172656 0.172905 0.182850
charge: -0.179747 0.152461 -0.176756 0.149344 -0.054586 0.003374 -0.199823 0.155947 0.157029 -0.207175 0.145938 0.150093 -0.221805 -0.008907 0.167917 0.151671 0.149133 0.175086 0.147832 0.166114 0.176861
qa: -0.1961 0.1635 -0.1930 0.1775 -0.0568 -0.0379 -0.2240 0.1596 0.1764 -0.2377 0.1522 0.1704 -0.2146 -0.0513 0.2111 0.1590 0.1449 0.1683 0.1727 0.1729 0.1828
va: 3.8745 0.9744 3.8800 0.9726 3.8436 3.7639 3.9045 0.9666 0.9683 3.8887 0.9711 0.9696 3.9228 3.7554 0.9402 0.9738 0.9729 0.9633 0.9710 0.9680 0.9578
total: -311.833146023 hartree
dispcorr: -0.011427071 hartree
energy: -311.844573094700
dipole: 0.55338 -0.70687 -0.15349 1.83671 -1.97353 -0.13682 0.22929 -0.42494 -0.19565
magnitude: 0.28383 au
magnitude: 0.72143 debye
