program: Orca
programVersion: 5.0.3
elementType: C H C H C C C H H C H H C C H H H H H H H
charge: 1
multiplicity: 1
keywords: DSD-PBEP86/2013 def2-TZVP D3BJ RIJCOSX verytightscf def2-TZVP/C def2/J soscf noTRAH
formula: C8H13
InChI: InChI=1/C8H13/c1-2-4-6-8-7-5-3-1/h1-2,7H,3-6,8H2
21 atoms
C  -1.990473 0.580972 0.092471
H  -2.167575 0.758415 1.159111
C  -1.840673 -0.962929 -0.173537
H  -2.654605 -1.500568 0.320914
C  -0.448346 -1.293938 0.344484
C  0.645798 -1.229742 -0.446631
C  1.939218 -0.693279 0.072625
H  2.098138 -0.944513 1.126462
H  2.807627 -1.036108 -0.499825
C  1.829332 0.856911 -0.095351
H  1.876717 1.117601 -1.159066
H  2.667749 1.358943 0.395831
C  0.492909 1.43115 0.511284
C  -0.670998 1.140116 -0.318167
H  0.526943 -1.277188 -1.53067
H  -1.902919 -1.159307 -1.24881
H  0.348228 1.128992 1.551464
H  -0.568029 1.405103 -1.375342
H  -2.811613 1.002959 -0.497033
H  0.622349 2.532147 0.484803
H  -0.322317 -1.314911 1.428215
totalener: -311.14880614 hartree
nucrepener: 380.60463729 hartree
electener: -691.75344343 hartree
oneelecener: -1161.63023294 hartree
twoeener: 469.87678951 hartree
kineticenergy: 310.01804549 hartree
exchangeener: -14.123785237758 hartree
correlationener: -0.943792406506 hartree
xcener: -15.067577644264 hartree
chargesum: 1.0000000
charge: -0.204578 0.173973 -0.209589 0.176536 -0.156515 -0.141025 -0.216270 0.155963 0.166620 -0.245051 0.151080 0.173845 -0.168987 0.092413 0.164564 0.165239 0.161762 0.211245 0.181785 0.201940 0.165049
charge: -0.194538 0.161982 -0.192306 0.151026 -0.109775 -0.129185 -0.219541 0.150572 0.154009 -0.195641 0.144761 0.150552 -0.213218 0.192509 0.154492 0.152790 0.158134 0.174753 0.160921 0.193946 0.153759
qa: -0.2046 0.1740 -0.2096 0.1765 -0.1565 -0.1410 -0.2163 0.1560 0.1666 -0.2451 0.1511 0.1738 -0.1690 0.0924 0.1646 0.1652 0.1618 0.2112 0.1818 0.2019 0.1650
va: 3.8420 0.9672 3.8551 0.9687 3.8712 3.8516 3.8946 0.9720 0.9712 3.8744 0.9707 0.9631 3.8610 3.5185 0.9639 0.9723 0.9765 0.9396 0.9680 0.9564 0.9643
total: -311.800370923 hartree
dispcorr: -0.014219144 hartree
energy: -311.814590066070
dipole: 0.48788 -1.02515 -0.53727 1.93932 -0.79032 1.14900 0.14604 -0.32092 -0.17488
magnitude: 1.28041 au
magnitude: 3.25453 debye
