program: Orca
programVersion: 5.0.3
elementType: C H C H C C C H H C H H C C H H H H H H H
charge: 1
multiplicity: 1
keywords: b3lyp def2-TZVP EnGrad RIJCOSX verytightscf def2/J soscf
formula: C8H13
InChI: InChI=1/C8H13/c1-2-4-6-8-7-5-3-1/h1-2,7H,3-6,8H2
21 atoms
C  -1.992741 0.599047 0.085283
H  -2.170537 0.770258 1.153383
C  -1.819763 -0.955896 -0.172309
H  -2.648039 -1.479005 0.314377
C  -0.436293 -1.314357 0.355274
C  0.653739 -1.24318 -0.43474
C  1.949952 -0.699498 0.072116
H  2.120709 -0.943014 1.12583
H  2.81744 -1.034784 -0.506528
C  1.820784 0.848043 -0.104322
H  1.86174 1.106528 -1.168621
H  2.651596 1.364385 0.384772
C  0.477725 1.410658 0.509236
C  -0.693509 1.182465 -0.323512
H  0.524436 -1.256596 -1.519285
H  -1.87755 -1.151047 -1.247947
H  0.326632 1.073674 1.537335
H  -0.600539 1.496815 -1.368095
H  -2.825974 0.992772 -0.505456
H  0.620621 2.511367 0.51923
H  -0.317145 -1.356203 1.438906
totalener: -312.22905633 hartree
nucrepener: 380.10891249 hartree
electener: -692.33796881 hartree
oneelecener: -1161.28358519 hartree
twoeener: 468.94561637 hartree
kineticenergy: 310.52441557 hartree
exchangeener: -36.322225138402 hartree
correlationener: -2.303892321644 hartree
xcener: -38.626117460046 hartree
chargesum: 1.0000000
charge: -0.184015 0.164755 -0.200049 0.164885 -0.128869 -0.087362 -0.206511 0.148238 0.159059 -0.229571 0.146898 0.162915 -0.119721 0.045152 0.146125 0.156187 0.149179 0.199680 0.169570 0.189795 0.153660
charge: -0.194089 0.165999 -0.189173 0.153076 -0.104677 -0.126617 -0.217150 0.152996 0.159563 -0.191618 0.148028 0.153681 -0.210068 0.138692 0.156109 0.154830 0.159930 0.172115 0.163232 0.201404 0.153738
qa: -0.1840 0.1648 -0.2000 0.1649 -0.1289 -0.0874 -0.2065 0.1482 0.1591 -0.2296 0.1469 0.1629 -0.1197 0.0452 0.1461 0.1562 0.1492 0.1997 0.1696 0.1898 0.1537
va: 3.8362 0.9662 3.8312 0.9680 3.8391 3.8008 3.8853 0.9698 0.9703 3.8622 0.9673 0.9639 3.8139 3.5792 0.9677 0.9707 0.9800 0.9451 0.9683 0.9567 0.9665
energy: -312.229056326590
dipole: 0.45289 -0.89468 -0.44180 1.96144 -0.88837 1.07307 0.14777 -0.26983 -0.12207
magnitude: 1.16686 au
magnitude: 2.96592 debye
