program: Orca
programVersion: 5.0.3
elementType: C H C H C C C H H C H H C C H H H H H H H
charge: 1
multiplicity: 1
keywords: DSD-PBEP86/2013 def2-TZVP RIJCOSX verytightscf def2-TZVP/C def2/J soscf noTRAH
formula: C8H13
InChI: InChI=1/C8H13/c1-2-4-6-8-7-5-3-1/h1-2,7H,3-6,8H2
21 atoms
C  -2.00569 0.708869 0.084303
H  -2.216339 0.879682 1.144025
C  -1.777025 -0.922827 -0.140966
H  -2.621346 -1.388964 0.370877
C  -0.4327 -1.346481 0.411233
C  0.699271 -1.28315 -0.362555
C  2.010372 -0.686021 0.074382
H  2.224813 -0.881369 1.130032
H  2.858828 -1.017407 -0.527564
C  1.805244 0.90479 -0.141631
H  1.865704 1.133904 -1.210621
H  2.621396 1.426603 0.361394
C  0.428886 1.287065 0.425601
C  -0.728748 1.315098 -0.362575
H  0.5308 -1.203934 -1.441154
H  -1.858269 -1.130196 -1.211495
H  0.037386 0.109843 0.524836
H  -0.578028 1.292604 -1.446379
H  -2.865018 0.999397 -0.521566
H  0.351175 1.553204 1.484301
H  -0.346467 -1.503582 1.488667
totalener: -311.09677050 hartree
nucrepener: 382.01747922 hartree
electener: -693.11424972 hartree
oneelecener: -1164.09238943 hartree
twoeener: 470.97813971 hartree
kineticenergy: 309.92746156 hartree
exchangeener: -12.750369447723 hartree
correlationener: -0.948326698248 hartree
xcener: -13.698696145971 hartree
chargesum: 1.0000000
charge: -0.215102 0.170735 -0.287463 0.186529 -0.090924 -0.070198 -0.205315 0.161542 0.176199 -0.304763 0.170710 0.181196 -0.046801 0.003402 0.151572 0.175744 0.074101 0.177586 0.186414 0.213006 0.191830
charge: -0.187961 0.154264 -0.181535 0.155637 -0.185144 -0.071395 -0.202053 0.150403 0.151670 -0.193895 0.147787 0.152406 -0.183484 0.028643 0.158657 0.149934 0.298453 0.168072 0.156306 0.173111 0.160125
qa: -0.2151 0.1707 -0.2875 0.1865 -0.0909 -0.0702 -0.2053 0.1615 0.1762 -0.3048 0.1707 0.1812 -0.0468 0.0034 0.1516 0.1757 0.0741 0.1776 0.1864 0.2130 0.1918
va: 3.8410 0.9715 3.9700 0.9645 3.6716 3.9138 3.8479 0.9724 0.9684 3.9759 0.9644 0.9695 3.5778 3.8461 0.9669 0.9647 1.1044 0.9577 0.9648 0.9546 0.9620
total: -311.793490479 hartree
energy: -311.793490479486
dipole: 0.00435 -0.26981 -0.26546 0.25313 0.17163 0.42476 0.13638 -0.21499 -0.07861
magnitude: 0.50702 au
magnitude: 1.28873 debye
