program: Orca
programVersion: 5.0.3
elementType: C H C H C C C H H C H H C C H H H H H H H
charge: 1
multiplicity: 1
keywords: PBE0 cc-pVTZ EnGrad D3BJ RIJCOSX verytightscf cc-pVTZ/C def2/J soscf
formula: C8H13
InChI: InChI=1/C8H13/c1-2-4-6-8-7-5-3-1/h1-2,7H,3-6,8H2
21 atoms
C  -1.999954 0.758677 0.069493
H  -2.16192 0.825414 1.147962
C  -1.729595 -0.970263 -0.160482
H  -2.618554 -1.321701 0.367442
C  -0.414653 -1.387444 0.3915
C  0.684885 -1.274566 -0.380274
C  2.000148 -0.693799 0.06263
H  2.20699 -0.894489 1.119373
H  2.855214 -1.035121 -0.527037
C  1.788205 0.852034 -0.138306
H  1.826617 1.114373 -1.201298
H  2.591997 1.401886 0.358331
C  0.422543 1.268476 0.492273
C  -0.76757 1.297759 -0.36945
H  0.519967 -1.197809 -1.459726
H  -1.832334 -1.12956 -1.234325
H  0.198856 0.633184 1.35394
H  -0.659432 1.608628 -1.412261
H  -2.883163 0.994632 -0.522369
H  0.48161 2.287544 0.93114
H  -0.332188 -1.482856 1.473527
totalener: -312.03242401 hartree
nucrepener: 379.37208242 hartree
electener: -691.40450643 hartree
oneelecener: -1159.77118013 hartree
twoeener: 468.36667370 hartree
kineticenergy: 309.64961423 hartree
exchangeener: -34.147049963634 hartree
correlationener: -1.960444756687 hartree
xcener: -36.107494720321 hartree
chargesum: 1.0000000
charge: -0.205472 0.177234 -0.180503 0.173809 -0.147290 -0.097647 -0.171845 0.134001 0.146420 -0.199374 0.136535 0.150264 -0.200751 0.107233 0.139829 0.168524 0.143464 0.202436 0.178588 0.188078 0.156466
charge: 0.131968 0.014495 0.174763 0.007470 0.018521 0.070492 0.073565 -0.002964 -0.002002 0.105417 -0.010419 0.000012 0.078101 0.298802 -0.015157 -0.000402 0.008911 0.016930 0.006082 0.047053 -0.021638
qa: -0.2055 0.1772 -0.1805 0.1738 -0.1473 -0.0976 -0.1718 0.1340 0.1464 -0.1994 0.1365 0.1503 -0.2008 0.1072 0.1398 0.1685 0.1435 0.2024 0.1786 0.1881 0.1565
va: 3.8583 0.9812 3.8805 0.9777 3.8142 3.8320 3.8838 0.9949 0.9886 3.8700 0.9930 0.9861 3.8870 3.5728 0.9943 0.9824 1.0085 0.9746 0.9833 0.9769 0.9945
dispcorr: -0.018954409 hartree
energy: -312.051378415169
dipole: 0.18134 -1.03462 -0.85329 1.68953 -0.57117 1.11835 0.36962 -0.48697 -0.11736
magnitude: 1.41159 au
magnitude: 3.58797 debye
