program: Orca
programVersion: 5.0.3
elementType: C H C H C C C H H C H H C C H H H H H H H
charge: 1
multiplicity: 1
keywords: DSD-PBEP86/2013 cc-pVTZ EnGrad RIJCOSX verytightscf cc-pVTZ/C def2/J soscf
formula: C8H13
InChI: InChI=1/C8H13/c1-2-4-6-8-7-5-3-1/h1-2,7H,3-6,8H2
21 atoms
C  -1.998124 0.527817 0.119517
H  -2.176749 0.722631 1.180477
C  -1.961788 -0.999351 -0.169071
H  -2.676489 -1.593785 0.40207
C  -0.521676 -1.130024 0.279847
C  0.60821 -1.116763 -0.506095
C  1.906505 -0.649218 0.063533
H  2.004727 -0.952739 1.111208
H  2.759547 -1.045249 -0.493972
C  1.899531 0.916307 -0.032579
H  2.031601 1.212023 -1.079939
H  2.74543 1.325679 0.525865
C  0.559817 1.481004 0.488444
C  -0.542245 0.807217 -0.260442
H  0.529286 -1.2975 -1.577657
H  -2.080051 -1.211561 -1.235668
H  0.444883 1.3653 1.571132
H  -0.419135 0.872084 -1.344526
H  -2.709847 1.102581 -0.481267
H  0.516269 2.559145 0.266911
H  -0.370805 -1.079156 1.359345
totalener: -311.17823539 hartree
nucrepener: 385.79197407 hartree
electener: -696.97020946 hartree
oneelecener: -1171.80490460 hartree
twoeener: 474.83469514 hartree
kineticenergy: 309.74213457 hartree
exchangeener: -12.760754758796 hartree
correlationener: -0.948240827082 hartree
xcener: -13.708995585878 hartree
chargesum: 1.0000000
charge: -0.219803 0.169523 -0.238712 0.185638 -0.063288 -0.063711 -0.253889 0.166362 0.184952 -0.252194 0.161865 0.183716 -0.237059 -0.070968 0.226359 0.169230 0.165240 0.203203 0.184335 0.198232 0.200972
charge: 0.097046 0.000301 0.101208 -0.000361 0.125161 0.165654 0.081710 0.001975 0.007112 0.096837 -0.005774 0.000303 0.063997 0.225643 0.002627 0.000214 -0.001097 0.002999 0.001059 0.023087 0.010300
qa: -0.2198 0.1695 -0.2387 0.1856 -0.0633 -0.0637 -0.2539 0.1664 0.1850 -0.2522 0.1619 0.1837 -0.2371 -0.0710 0.2264 0.1692 0.1652 0.2032 0.1843 0.1982 0.2010
va: 3.8684 0.9854 3.8875 0.9761 3.8011 3.7883 3.9234 0.9833 0.9758 3.8937 0.9808 0.9720 3.8992 3.7422 0.9593 0.9857 0.9835 0.9759 0.9742 0.9670 0.9769
energy: -311.882324689754
dipole: 0.56102 -0.72114 -0.16011 1.85290 -1.78772 0.06518 0.19100 -0.34645 -0.15545
magnitude: 0.23248 au
magnitude: 0.59093 debye
