program: Orca
programVersion: 5.0.3
elementType: C H C H C C C H H C H H C C H H H H H H H
charge: 1
multiplicity: 1
keywords: DSD-PBEP86/2013 def2-TZVP RIJCOSX verytightscf def2-TZVP/C def2/J soscf noTRAH
formula: C8H13
InChI: InChI=1/C8H13/c1-2-4-6-8-7-5-3-1/h1-2,7H,3-6,8H2
21 atoms
C  -1.997221 0.750735 0.07388
H  -2.176786 0.85159 1.147399
C  -1.73861 -0.950068 -0.150819
H  -2.618385 -1.323541 0.378017
C  -0.423366 -1.377559 0.39915
C  0.691209 -1.28216 -0.369941
C  2.004883 -0.688166 0.065271
H  2.216279 -0.87936 1.123094
H  2.857713 -1.029508 -0.526664
C  1.794455 0.878547 -0.144693
H  1.847672 1.128207 -1.209686
H  2.60203 1.418653 0.35548
C  0.422132 1.25372 0.468374
C  -0.762817 1.312746 -0.379276
H  0.527478 -1.212253 -1.44992
H  -1.840625 -1.122347 -1.222982
H  0.146112 0.397661 1.122506
H  -0.646639 1.486378 -1.452745
H  -2.876546 0.984405 -0.525747
H  0.418919 2.043087 1.239657
H  -0.34357 -1.504445 1.479554
totalener: -311.11636899 hartree
nucrepener: 380.08559095 hartree
electener: -691.20195994 hartree
oneelecener: -1160.53891721 hartree
twoeener: 469.33695727 hartree
kineticenergy: 309.97520695 hartree
exchangeener: -12.752694672084 hartree
correlationener: -0.944258321254 hartree
xcener: -13.696952993338 hartree
chargesum: 1.0000000
charge: -0.259744 0.196164 -0.218663 0.193963 -0.194375 -0.119885 -0.211954 0.157717 0.166921 -0.290341 0.156895 0.170921 -0.127972 0.099405 0.143124 0.185042 0.136684 0.209057 0.196251 0.229711 0.181078
charge: -0.169655 0.165765 -0.128358 0.159202 -0.198849 -0.117089 -0.211456 0.147980 0.147295 -0.201435 0.141500 0.150417 -0.216826 0.153172 0.150779 0.152836 0.202888 0.173033 0.159009 0.190205 0.149587
qa: -0.2597 0.1962 -0.2187 0.1940 -0.1944 -0.1199 -0.2120 0.1577 0.1669 -0.2903 0.1569 0.1709 -0.1280 0.0994 0.1431 0.1850 0.1367 0.2091 0.1963 0.2297 0.1811
va: 3.8564 0.9610 3.8651 0.9566 3.8097 3.8773 3.8579 0.9713 0.9740 3.9154 0.9678 0.9705 3.6955 3.5745 0.9675 0.9602 1.0253 0.9465 0.9641 0.9395 0.9600
total: -311.802882044 hartree
energy: -311.802882043646
dipole: 0.10635 -0.97901 -0.87266 1.15963 -0.01075 1.14888 0.42914 -0.56953 -0.14039
magnitude: 1.44954 au
magnitude: 3.68444 debye
