program: Orca
programVersion: 5.0.3
elementType: C H C H C C C H H C H H C C H H H H H H H
charge: 1
multiplicity: 1
keywords: m062x cc-pVTZ EnGrad RIJCOSX verytightscf cc-pVTZ/C def2/J soscf
formula: C8H13
InChI: InChI=1/C8H13/c1-2-4-6-8-7-5-3-1/h1-2,7H,3-6,8H2
21 atoms
C  -1.991644 0.551619 0.111363
H  -2.167263 0.736888 1.175317
C  -1.894171 -0.979101 -0.174804
H  -2.667728 -1.546685 0.347919
C  -0.480282 -1.231613 0.313443
C  0.62812 -1.185424 -0.476805
C  1.919107 -0.674972 0.071524
H  2.047364 -0.948822 1.124104
H  2.786173 -1.039554 -0.487688
C  1.855221 0.882524 -0.067523
H  1.930695 1.154882 -1.127077
H  2.705785 1.344627 0.441362
C  0.527533 1.468622 0.506718
C  -0.612434 1.002721 -0.297868
H  0.532515 -1.306699 -1.555977
H  -1.977917 -1.176481 -1.24823
H  0.395221 1.260623 1.57244
H  -0.480915 1.123998 -1.376919
H  -2.772631 1.04612 -0.477621
H  0.592892 2.5663 0.386174
H  -0.340093 -1.204565 1.395707
totalener: -312.29899686 hartree
nucrepener: 382.50927024 hartree
electener: -694.80826709 hartree
oneelecener: -1165.69463123 hartree
twoeener: 470.88636414 hartree
kineticenergy: 310.01511499 hartree
xcener: -23.088837665907 hartree
chargesum: 1.0000000
charge: -0.275741 0.197690 -0.277321 0.189743 -0.111642 -0.104931 -0.310125 0.189441 0.190119 -0.270276 0.179945 0.192287 -0.307877 0.026995 0.228006 0.188108 0.203484 0.239153 0.194220 0.225767 0.212954
charge: 0.087635 0.004031 0.090919 0.000606 0.109697 0.103625 0.072423 0.000845 0.006724 0.101350 -0.005555 0.000921 0.065693 0.310132 -0.007597 0.001277 0.003873 0.011295 0.008043 0.037435 -0.003373
qa: -0.2757 0.1977 -0.2773 0.1897 -0.1116 -0.1049 -0.3101 0.1894 0.1901 -0.2703 0.1799 0.1923 -0.3079 0.0270 0.2280 0.1881 0.2035 0.2392 0.1942 0.2258 0.2130
va: 3.7178 0.9570 3.7572 0.9589 3.6467 3.6279 3.7865 0.9582 0.9602 3.7219 0.9558 0.9515 3.7548 3.4464 0.9418 0.9627 0.9523 0.9391 0.9577 0.9452 0.9521
energy: -312.298996856150
dipole: 0.54736 -0.86061 -0.31325 1.88215 -1.25607 0.62608 0.15866 -0.29612 -0.13746
magnitude: 0.71344 au
magnitude: 1.81341 debye
