program: Gaussian 09
title: 000050839
version: EM64L-G09RevD.01
frameworkgroup: C1[X(C14H21NO3)]
method: RPBEPBE
basis: SDD
operation: Freq
keyword: #p
keyword: freq=noraman
keyword: PBEPBE/SDD
title: #p freq=noraman PBEPBE/SDD
converged: YES YES NO NO
title: Mulliken charges:
elementType: O O O N C C C C C C C C C C C C C C H H H H H H H H H H H H H H H H H H H H H
charge: -0.246136 -0.261059 -0.429048 -0.101562 -0.337566 -0.350550 -0.364205 -0.318744 -0.314879 -0.265233 -0.018976 -0.582977 0.455557 -0.369736 -0.433161 -0.228481 -0.222146 -0.245707 0.197345 0.200973 0.214448 0.193488 0.201539 0.223598 0.191417 0.215621 0.215299 0.192909 0.211618 0.187939 0.203414 0.228694 0.244443 0.256865 0.232291 0.349714 0.222820 0.223752 0.226422
chargesum: 0.00000
title: Mulliken charges with hydrogens summed into heavy atoms:
elementType: O O O N C C C C C C C C C C C C C C
charge: -0.246136 -0.261059 -0.079333 -0.101562 0.060751 0.057386 0.060933 0.088294 0.093330 0.134323 0.184438 -0.109839 0.455557 -0.112872 -0.200870 -0.005661 0.001605 -0.019285
polarizability: 1.86213829e+02 6.54173045e+00 1.68170217e+02 -2.10849400e+01 2.98301582e+00 1.34500230e+02
1716.lowfreq: -4.8882 -3.9485 -0.0005 -0.0003 0.0002 3.4303 11.7055 19.1576 26.8945
frequency: 11.1258 18.5219 26.8605 46.2354 56.2899 74.2946 96.6684 115.3183 154.9526 183.4196 234.5127 249.4839 259.3335 292.4190 308.4981 325.4771 343.9111 373.5832 402.0666 403.6877 443.9959 468.0774 475.9733 535.4683 544.5257 597.7038 610.0153 618.0528 704.7274 756.2748 759.4013 804.3562 806.6490 816.7924 833.5446 841.0718 854.1577 897.5103 914.6027 954.1542 971.5824 976.6004 990.2216 992.9076 998.0703 1009.3635 1027.6335 1028.4347 1036.1630 1051.9963 1062.3922 1078.2293 1084.3575 1093.9351 1109.9564 1137.7187 1149.9925 1163.6130 1171.4222 1188.6494 1190.1086 1204.5541 1216.0759 1237.5012 1254.5104 1270.1455 1288.1089 1294.0624 1307.6307 1309.0938 1327.9478 1332.3183 1339.5714 1351.5771 1366.7692 1372.1175 1381.8324 1384.4091 1400.9220 1439.5567 1443.2813 1448.4100 1452.3012 1456.9175 1460.6612 1471.9426 1484.0937 1484.9813 1592.2600 1614.9079 2864.0672 2871.1511 2898.0109 2918.2509 2931.7536 2954.1420 2958.5084 2999.6303 3017.1451 3028.8617 3032.2946 3049.0831 3080.8844 3083.8364 3084.5459 3114.5320 3123.2407 3137.1149 3151.2280 3163.3550 3562.6948
redmass: 5.2776 2.9888 4.0279 4.0523 3.8144 4.6067 2.9733 3.4841 3.8900 4.3407 2.1769 2.6387 2.6576 1.8041 3.0305 2.4321 2.5294 2.4052 2.0286 2.7720 4.4809 2.9020 3.7380 5.4916 2.8296 2.8799 2.8498 6.1302 1.8120 1.8627 3.5237 2.6656 1.5067 3.8728 2.4364 1.6627 1.2467 2.3014 1.5615 4.6409 2.4193 1.4894 4.7817 1.4760 2.7105 2.8285 2.3277 2.1789 2.7053 2.2400 2.0319 2.3167 1.6656 3.2315 2.2338 2.5022 1.7749 1.1783 1.0539 1.1237 1.0640 1.3392 2.3043 1.2910 1.3646 1.2702 1.1875 1.2940 1.2367 1.4414 1.2531 1.2599 1.2308 1.3243 1.4186 1.2721 3.7445 1.9628 1.5085 2.1025 1.0825 1.0795 1.0968 1.1237 1.0945 1.0853 1.3788 1.5955 6.0586 6.1269 1.0704 1.0693 1.0694 1.0835 1.0587 1.0665 1.0666 1.1005 1.0607 1.0889 1.0911 1.0927 1.0962 1.1011 1.0978 1.0862 1.0870 1.0927 1.0957 1.1008 1.0661
irintensity: 0.1307 0.0888 0.0595 0.9511 0.0854 3.3229 0.0235 4.0014 7.4434 0.6243 7.2711 8.7820 18.9833 88.0733 7.4148 15.9194 31.9411 7.3528 0.7408 0.3715 7.4549 0.2427 5.1827 12.2993 26.9817 5.7977 9.9647 1.1443 56.1988 43.5869 22.3327 24.5640 24.0162 17.8134 10.5867 1.6897 0.3527 7.5176 17.9159 162.1246 12.5693 0.7838 0.0352 2.6846 4.8569 83.2185 9.5277 2.2363 144.9518 22.0175 12.0811 9.3720 16.0132 70.0379 2.8698 66.3384 1.0793 47.0590 1.0580 0.8402 2.3202 1.1965 0.9201 4.4429 18.0794 3.8590 16.6953 4.9389 29.4148 8.1654 1.1673 3.1539 8.8012 4.5779 1.2740 1.7108 7.6627 17.6375 13.7151 6.5755 2.5201 0.7285 18.9794 13.9560 4.3847 9.0763 9.7374 15.4695 0.7472 6.2221 47.8653 78.9973 97.4221 49.4001 64.9512 34.9249 98.8851 45.5000 16.0445 46.3404 30.3560 44.0465 39.1312 13.0427 32.8206 7.3872 0.9299 30.2390 36.8944 13.7785 4.9411
temp: 298.150 k
press: 1.00000 atm
elementType: 8 8 8 7 6 6 6 6 6 6 6 6 6 6 6 6 6 6 1 1 1 1 1 1 1 1 1 1 1 1 1 1 1 1 1 1 1 1 1
symmnumber: 1
zpe: 865736.6 jmol-1
zpe.correction: 0.329742 hartree
zpe.thermalcorrener: 0.347764 hartree
zpe.thermalcorrenthalpy: 0.348708 hartree
zpe.thermalcorrgfe: 0.279663 hartree
zpe.sumelectzpe: -825.062218 hartree
zpe.sumelectthermal: -825.044195 hartree
zpe.sumelectthermalent: -825.043251 hartree
zpe.sumelectthermalfe: -825.112297 hartree
dipole: 0.4380 -0.0057 1.4044
dipole: 1.4711
quadrupole: -121.4250 -110.2997 -102.4296
quadrupole: 10.7659 -9.0770 5.1876
quadrupole: -10.0402 1.0850 8.9552 10.7659 -9.0770 5.1876
hfenergy: -825.3919594 hartree
pointgroup: C01 [X(C14H21N1O3)]
dipole: 0.1791642 -0.0121279 -0.5502164 debye
polarizability: 186.2768203|-4.7343442|167.8300818|21.7991384|2.5975919|134.7773742 unknown
InChI: InChI=1S/C14H21NO3/c16-14(12-13-4-2-1-3-5-13)18-11-8-15-6-9-17-10-7-15/h1-5,14,16H,6-12H2
charge 0 multiplicity 1
39 atoms
O  5.604843 1.298597 -0.493622
O  -0.40025 -1.272367 0.553793
O  -1.166587 -3.441538 -0.22563
N  3.103475 0.006654 0.233217
C  3.223165 0.819336 -1.006562
C  4.038496 0.518395 1.269478
C  1.709432 -0.112814 0.719813
C  4.673879 0.792636 -1.51515
C  5.478418 0.490778 0.731714
C  0.934045 -1.185267 -0.060138
C  -1.384344 -1.994842 -0.244614
C  -2.761612 -1.758948 0.388867
C  -3.308209 -0.357137 0.157913
C  -2.768322 0.763559 0.842405
C  -4.373876 -0.144707 -0.754126
C  -3.282544 2.060284 0.619853
C  -4.889612 1.152503 -0.981142
C  -4.3448 2.260703 -0.293403
H  2.918128 1.880968 -0.823609
H  2.557683 0.406324 -1.787369
H  3.969527 -0.126485 2.165735
H  3.784939 1.564852 1.574589
H  1.150315 0.852403 0.668169
H  1.731187 -0.421071 1.780976
H  4.950649 -0.24765 -1.79237
H  4.802461 1.456445 -2.386078
H  6.182423 0.937201 1.453254
H  5.774185 -0.559429 0.519394
H  1.474094 -2.150694 0.020201
H  0.835736 -0.914846 -1.135095
H  -1.333602 -1.617608 -1.293539
H  -3.446555 -2.513211 -0.035361
H  -2.653781 -1.975469 1.467575
H  -1.941122 0.608293 1.542986
H  -4.807384 -1.002329 -1.284104
H  -0.343676 -3.667016 -0.729446
H  -2.858335 2.914649 1.160204
H  -5.716033 1.296121 -1.686748
H  -4.745333 3.266729 -0.462829
