program: Orca
programVersion: 5.0.3
elementType: C H C H C C C H H C H H C C H H H H H H H
charge: 1
multiplicity: 1
keywords: DSD-PBEP86/2013 def2-TZVP D3BJ RIJCOSX verytightscf def2-TZVP/C def2/J soscf noTRAH
formula: C8H13
InChI: InChI=1/C8H13/c1-2-4-6-8-7-5-3-1/h1-2,7H,3-6,8H2
21 atoms
C  -1.991165 0.587406 0.089514
H  -2.16856 0.762873 1.156683
C  -1.832512 -0.960106 -0.173051
H  -2.652104 -1.492486 0.31796
C  -0.443579 -1.302087 0.348866
C  0.648875 -1.235297 -0.441924
C  1.943281 -0.695832 0.072492
H  2.106943 -0.943949 1.126307
H  2.811382 -1.035576 -0.502433
C  1.825917 0.853318 -0.099052
H  1.870486 1.112948 -1.163062
H  2.661488 1.361096 0.39102
C  0.487007 1.423442 0.510713
C  -0.679908 1.157611 -0.32039
H  0.525988 -1.269623 -1.526292
H  -1.89257 -1.156109 -1.248495
H  0.339982 1.107199 1.546209
H  -0.581364 1.443553 -1.372565
H  -2.817251 0.998312 -0.500424
H  0.622696 2.524347 0.498666
H  -0.320141 -1.331396 1.432603
totalener: -311.14742700 hartree
nucrepener: 380.39487109 hartree
electener: -691.54229808 hartree
oneelecener: -1161.21689125 hartree
twoeener: 469.67459317 hartree
kineticenergy: 310.01799726 hartree
exchangeener: -14.123623031211 hartree
correlationener: -0.943632702873 hartree
xcener: -15.067255734084 hartree
chargesum: 1.0000000
charge: -0.205148 0.175051 -0.210888 0.176664 -0.162086 -0.142295 -0.214760 0.155836 0.166112 -0.247126 0.151443 0.173802 -0.165594 0.096942 0.161959 0.166035 0.161917 0.212692 0.182022 0.202571 0.164852
charge: -0.193545 0.163044 -0.190953 0.151214 -0.114939 -0.133038 -0.219738 0.150394 0.153773 -0.194638 0.144636 0.150560 -0.212032 0.196090 0.153954 0.152777 0.158557 0.174996 0.161061 0.194953 0.152872
qa: -0.2051 0.1751 -0.2109 0.1767 -0.1621 -0.1423 -0.2148 0.1558 0.1661 -0.2471 0.1514 0.1738 -0.1656 0.0969 0.1620 0.1660 0.1619 0.2127 0.1820 0.2026 0.1649
va: 3.8425 0.9666 3.8559 0.9684 3.8714 3.8495 3.8928 0.9722 0.9714 3.8766 0.9704 0.9630 3.8551 3.5092 0.9645 0.9717 0.9772 0.9389 0.9678 0.9558 0.9644
total: -311.798770309 hartree
dispcorr: -0.014201951 hartree
energy: -311.812972260156
dipole: 0.47501 -1.03241 -0.55740 1.94834 -0.74063 1.20771 0.14615 -0.32218 -0.17602
magnitude: 1.34173 au
magnitude: 3.41041 debye
