program: Orca
programVersion: 5.0.3
elementType: C H C H C C C H H C H H C C H H H H H H H
charge: 1
multiplicity: 1
keywords: DSD-PBEP86/2013 def2-TZVP D3BJ RIJCOSX verytightscf def2-TZVP/C def2/J soscf noTRAH
formula: C8H13
InChI: InChI=1/C8H13/c1-2-4-6-8-7-5-3-1/h1-2,7H,3-6,8H2
21 atoms
C  -2.00118 0.75511 0.069179
H  -2.163172 0.81911 1.147818
C  -1.730073 -0.973257 -0.162881
H  -2.618976 -1.328141 0.36287
C  -0.412901 -1.387169 0.389835
C  0.683431 -1.272793 -0.38345
C  1.998516 -0.696317 0.062614
H  2.203862 -0.900836 1.118857
H  2.854354 -1.036047 -0.527094
C  1.787734 0.846095 -0.13587
H  1.823372 1.10961 -1.198734
H  2.591938 1.396736 0.359276
C  0.423757 1.27787 0.494742
C  -0.766865 1.294418 -0.364447
H  0.518349 -1.193878 -1.462709
H  -1.830568 -1.132495 -1.237054
H  0.208968 0.687276 1.389177
H  -0.659236 1.623987 -1.401574
H  -2.882936 0.997013 -0.522556
H  0.495739 2.323581 0.866332
H  -0.328891 -1.478056 1.472022
totalener: -311.12742718 hartree
nucrepener: 379.26048563 hartree
electener: -690.38791281 hartree
oneelecener: -1158.97502310 hartree
twoeener: 468.58711029 hartree
kineticenergy: 310.02083696 hartree
exchangeener: -14.120950001303 hartree
correlationener: -0.942810444976 hartree
xcener: -15.063760446278 hartree
chargesum: 1.0000000
charge: -0.277216 0.200085 -0.194930 0.192903 -0.209861 -0.102966 -0.213129 0.153804 0.164957 -0.268897 0.152569 0.169323 -0.151607 0.108667 0.139361 0.187399 0.153192 0.216180 0.195600 0.212389 0.172177
charge: -0.166291 0.169106 -0.110675 0.157293 -0.185295 -0.121278 -0.215810 0.148660 0.148284 -0.201595 0.142304 0.150409 -0.207039 0.144581 0.151280 0.152385 0.167327 0.174114 0.157358 0.196291 0.148590
qa: -0.2772 0.2001 -0.1949 0.1929 -0.2099 -0.1030 -0.2131 0.1538 0.1650 -0.2689 0.1526 0.1693 -0.1516 0.1087 0.1394 0.1874 0.1532 0.2162 0.1956 0.2124 0.1722
va: 3.8805 0.9578 3.8268 0.9577 3.8506 3.8459 3.8734 0.9727 0.9733 3.9064 0.9691 0.9669 3.7889 3.5429 0.9687 0.9586 0.9934 0.9441 0.9653 0.9462 0.9640
total: -311.781486620 hartree
dispcorr: -0.014185605 hartree
energy: -311.795672224435
dipole: 0.19927 -1.09214 -0.89286 1.76794 -0.51278 1.25515 0.34331 -0.52640 -0.18309
magnitude: 1.55117 au
magnitude: 3.94277 debye
