program: Orca
programVersion: 5.0.3
elementType: C H C H C C C H H C H H C C H H H H H H H
charge: 1
multiplicity: 1
keywords: DSD-PBEP86/2013 cc-pVTZ EnGrad RIJCOSX verytightscf cc-pVTZ/C def2/J soscf
formula: C8H13
InChI: InChI=1/C8H13/c1-3-7-5-2-6-8(4-1)9-7/h3,6-8H,1-2,4-5H2
21 atoms
C  -2.006059 0.693082 0.090093
H  -2.216965 0.877812 1.147645
C  -1.795624 -0.920753 -0.137703
H  -2.627612 -1.413372 0.368735
C  -0.438572 -1.337661 0.409471
C  0.698413 -1.278965 -0.361781
C  2.010025 -0.683109 0.080104
H  2.223715 -0.882172 1.134802
H  2.856752 -1.01407 -0.52404
C  1.810261 0.913074 -0.138045
H  1.875462 1.136715 -1.207744
H  2.627565 1.428565 0.369478
C  0.43589 1.302298 0.414539
C  -0.713477 1.305023 -0.357083
H  0.532168 -1.205006 -1.440869
H  -1.869166 -1.131409 -1.209002
H  0.012141 0.036331 0.328806
H  -0.561401 1.275702 -1.440159
H  -2.861274 1.00572 -0.511162
H  0.342798 1.431111 1.496508
H  -0.344604 -1.464587 1.490404
totalener: -311.09668115 hartree
nucrepener: 382.56886149 hartree
electener: -693.66554264 hartree
oneelecener: -1165.06992318 hartree
twoeener: 471.40438054 hartree
kineticenergy: 309.65607691 hartree
exchangeener: -12.748219907136 hartree
correlationener: -0.948974439743 hartree
xcener: -13.697194346879 hartree
chargesum: 1.0000000
charge: -0.252676 0.176715 -0.276573 0.188741 -0.078808 -0.052149 -0.250596 0.173171 0.187821 -0.271147 0.171801 0.187791 -0.082302 -0.035054 0.182427 0.173809 0.078495 0.188889 0.190126 0.200425 0.199093
charge: 0.106570 -0.001726 0.115027 0.001605 0.107739 0.152384 0.101741 -0.002468 0.002299 0.114898 -0.004499 0.000959 0.118758 0.176694 0.001141 -0.004497 -0.007522 0.004467 0.003328 0.010409 0.002694
qa: -0.2527 0.1767 -0.2766 0.1887 -0.0788 -0.0521 -0.2506 0.1732 0.1878 -0.2711 0.1718 0.1878 -0.0823 -0.0351 0.1824 0.1738 0.0785 0.1889 0.1901 0.2004 0.1991
va: 3.8864 0.9801 3.9280 0.9729 3.7893 3.8121 3.8883 0.9815 0.9719 3.9244 0.9818 0.9740 3.7881 3.7909 0.9815 0.9806 1.1348 0.9785 0.9718 0.9787 0.9778
energy: -311.813385914997
dipole: -0.00975 -0.05248 -0.06223 0.07656 0.02886 0.10542 0.00335 -0.01846 -0.01511
magnitude: 0.12334 au
magnitude: 0.31352 debye
