program: Orca
programVersion: 5.0.3
elementType: C H C H C C C H H C H H C C H H H H H H H
charge: 1
multiplicity: 1
keywords: DSD-PBEP86 def2-TZVP D3BJ RIJCOSX verytightscf def2-TZVP/C def2/J soscf noTRAH
formula: C8H13
InChI: InChI=1/C8H13/c1-2-4-6-8-7-5-3-1/h1-2,7H,3-6,8H2
21 atoms
C  -1.995701 0.517715 0.09324
H  -2.188691 0.75516 1.142745
C  -1.997644 -1.017576 -0.141432
H  -2.683347 -1.594112 0.48024
C  -0.543601 -1.087015 0.281192
C  0.58262 -1.067631 -0.52283
C  1.90141 -0.630159 0.036279
H  2.005639 -0.975352 1.070541
H  2.730279 -1.037161 -0.548589
C  1.932873 0.936754 0.002994
H  2.12096 1.273551 -1.02274
H  2.755992 1.303954 0.621486
C  0.570943 1.472743 0.483736
C  -0.499856 0.713181 -0.252761
H  0.491806 -1.271563 -1.588904
H  -2.143619 -1.277222 -1.193608
H  0.449365 1.382242 1.568494
H  -0.386828 0.802035 -1.336689
H  -2.659282 1.106715 -0.545319
H  0.473533 2.537673 0.231146
H  -0.376898 -1.038712 1.357962
totalener: -311.15877797 hartree
nucrepener: 387.43445236 hartree
electener: -698.59323033 hartree
oneelecener: -1175.07705299 hartree
twoeener: 476.48382266 hartree
kineticenergy: 310.04674367 hartree
exchangeener: -13.679356335350 hartree
correlationener: -0.928438506972 hartree
xcener: -14.607794842322 hartree
chargesum: 1.0000000
charge: -0.194346 0.163212 -0.193232 0.177605 -0.060191 -0.035657 -0.222957 0.159401 0.177055 -0.237544 0.152222 0.170919 -0.212647 -0.054934 0.210724 0.158737 0.145233 0.168347 0.172749 0.173175 0.182127
charge: -0.180214 0.152354 -0.176858 0.149229 -0.057876 0.005939 -0.199829 0.155921 0.157285 -0.206857 0.145972 0.150241 -0.221875 -0.008086 0.167956 0.151608 0.149342 0.174642 0.147866 0.166491 0.176748
qa: -0.1943 0.1632 -0.1932 0.1776 -0.0602 -0.0357 -0.2230 0.1594 0.1771 -0.2375 0.1522 0.1709 -0.2126 -0.0549 0.2107 0.1587 0.1452 0.1683 0.1727 0.1732 0.1821
va: 3.8730 0.9746 3.8795 0.9726 3.8465 3.7651 3.9042 0.9670 0.9681 3.8871 0.9712 0.9693 3.9223 3.7574 0.9408 0.9739 0.9731 0.9632 0.9711 0.9679 0.9585
total: -311.833010049 hartree
dispcorr: -0.011439768 hartree
energy: -311.844449816850
dipole: 0.55187 -0.69304 -0.14116 1.84142 -1.97181 -0.13039 0.22174 -0.41959 -0.19785
magnitude: 0.27581 au
magnitude: 0.70106 debye
