program: Orca
programVersion: 5.0.3
elementType: C H C H C C C H H C H H C C H H H H H H H
charge: 1
multiplicity: 1
keywords: b3lyp def2-TZVP EnGrad RIJCOSX verytightscf def2/J soscf
formula: C8H13
InChI: InChI=1/C8H12.H/c1-2-4-6-8-7-5-3-1;/h1-2,7-8H,3-6H2;
21 atoms
C  -1.978812 0.655455 0.1202
H  -2.139582 0.846892 1.185772
C  -1.846881 -0.946412 -0.121768
H  -2.652001 -1.441227 0.424354
C  -0.467594 -1.345097 0.376898
C  0.675242 -1.260629 -0.381554
C  1.979433 -0.656631 0.108341
H  2.14368 -0.857723 1.171598
H  2.84522 -1.011513 -0.453649
C  1.846877 0.947372 -0.119002
H  1.960865 1.170451 -1.184473
H  2.653147 1.437791 0.429361
C  0.468652 1.34063 0.387071
C  -0.676813 1.265274 -0.36839
H  0.548499 -1.264396 -1.467468
H  -1.964058 -1.159892 -1.188882
H  0.000154 0.001452 0.015283
H  -0.554102 1.282183 -1.454733
H  -2.846643 1.015158 -0.435553
H  0.350204 1.324599 1.47466
H  -0.346591 -1.344429 1.463048
totalener: -312.18767631 hartree
nucrepener: 382.92109133 hartree
electener: -695.10876764 hartree
oneelecener: -1166.37556534 hartree
twoeener: 471.26679769 hartree
kineticenergy: 310.50193366 hartree
exchangeener: -36.318898133803 hartree
correlationener: -2.309265198177 hartree
xcener: -38.628163331980 hartree
chargesum: 1.0000000
charge: -0.222484 0.157256 -0.225090 0.171458 -0.068594 -0.060019 -0.222782 0.157196 0.171039 -0.225625 0.157434 0.171527 -0.066738 -0.060520 0.158194 0.157487 0.201443 0.158315 0.171075 0.159700 0.159729
charge: -0.195020 0.153116 -0.194836 0.156972 -0.112300 -0.106583 -0.195006 0.153059 0.156960 -0.194804 0.153001 0.156958 -0.112399 -0.105920 0.163964 0.153036 0.320768 0.164031 0.157005 0.164228 0.163772
qa: -0.2225 0.1573 -0.2251 0.1715 -0.0686 -0.0600 -0.2228 0.1572 0.1710 -0.2256 0.1574 0.1715 -0.0667 -0.0605 0.1582 0.1575 0.2014 0.1583 0.1711 0.1597 0.1597
va: 3.8779 0.9683 3.8812 0.9672 3.7939 3.7952 3.8785 0.9683 0.9673 3.8819 0.9683 0.9672 3.7910 3.7970 0.9636 0.9683 0.9698 0.9636 0.9673 0.9636 0.9635
energy: -312.187676312943
dipole: -0.00114 -0.00008 -0.00122 -0.00049 0.00356 0.00307 -0.01948 0.01561 -0.00387
magnitude: 0.00509 au
magnitude: 0.01293 debye
