program: Orca
programVersion: 5.0.3
elementType: C H C H C C C H H C H H C C H H H H H H H
charge: 1
multiplicity: 1
keywords: DSD-PBEP86 def2-TZVP D3BJ RIJCOSX verytightscf def2-TZVP/C def2/J soscf noTRAH
formula: C8H13
InChI: InChI=1/C8H13/c1-2-4-6-8-7-5-3-1/h1-2,7H,3-6,8H2
21 atoms
C  -2.002446 0.700915 0.072661
H  -2.176429 0.794584 1.148755
C  -1.751422 -0.967389 -0.171501
H  -2.627607 -1.382707 0.333662
C  -0.410732 -1.370595 0.378728
C  0.673393 -1.266852 -0.401749
C  1.983865 -0.707338 0.066288
H  2.179033 -0.930674 1.120421
H  2.845708 -1.038159 -0.521493
C  1.796276 0.831125 -0.123533
H  1.82986 1.093128 -1.186956
H  2.605556 1.377526 0.368249
C  0.438112 1.337379 0.49934
C  -0.753246 1.270249 -0.339465
H  0.515058 -1.192726 -1.482114
H  -1.832315 -1.140808 -1.246707
H  0.257377 0.901111 1.483863
H  -0.655054 1.628224 -1.369036
H  -2.868236 0.991594 -0.523825
H  0.560798 2.434492 0.646493
H  -0.316668 -1.444179 1.461748
totalener: -311.11696630 hartree
nucrepener: 379.09690709 hartree
electener: -690.21387339 hartree
oneelecener: -1158.64604553 hartree
twoeener: 468.43217214 hartree
kineticenergy: 310.00917871 hartree
exchangeener: -13.666150085676 hartree
correlationener: -0.921273401553 hartree
xcener: -14.587423487229 hartree
chargesum: 1.0000000
charge: -0.254037 0.192167 -0.206946 0.186379 -0.197068 -0.118939 -0.207095 0.152771 0.163610 -0.264874 0.153107 0.171185 -0.153464 0.119659 0.140143 0.181468 0.160757 0.218422 0.191083 0.205515 0.166158
charge: -0.172731 0.168920 -0.136978 0.154491 -0.168474 -0.137044 -0.218431 0.148946 0.149874 -0.196589 0.143378 0.150494 -0.202753 0.168320 0.150946 0.151528 0.161684 0.176139 0.158964 0.200661 0.148656
qa: -0.2540 0.1922 -0.2069 0.1864 -0.1971 -0.1189 -0.2071 0.1528 0.1636 -0.2649 0.1531 0.1712 -0.1535 0.1197 0.1401 0.1815 0.1608 0.2184 0.1911 0.2055 0.1662
va: 3.8715 0.9605 3.8397 0.9617 3.8660 3.8448 3.8772 0.9734 0.9725 3.9026 0.9684 0.9642 3.8218 3.5085 0.9687 0.9621 0.9835 0.9393 0.9661 0.9513 0.9656
total: -311.787457729 hartree
dispcorr: -0.011820274 hartree
energy: -311.799278003073
dipole: 0.29693 -1.10203 -0.80510 1.95807 -0.55840 1.39967 0.21821 -0.40466 -0.18645
magnitude: 1.62543 au
magnitude: 4.13152 debye
