program: Orca
programVersion: 5.0.3
elementType: C H C H C C C H H C H H C C H H H H H H H
charge: 1
multiplicity: 1
keywords: PBE0 def2-TZVP EnGrad D3BJ RIJCOSX verytightscf def2/J soscf
formula: C8H13
InChI: InChI=1/C8H13/c1-2-4-6-8-7-5-3-1/h1-2,7H,3-6,8H2
21 atoms
C  -2.00098 0.674135 0.074595
H  -2.177207 0.791453 1.149034
C  -1.765879 -0.959422 -0.172077
H  -2.632069 -1.406878 0.323827
C  -0.413159 -1.360143 0.374604
C  0.669761 -1.264186 -0.408394
C  1.976927 -0.707717 0.06807
H  2.168311 -0.935441 1.121862
H  2.840764 -1.036508 -0.518764
C  1.801621 0.832457 -0.119926
H  1.835863 1.092968 -1.183684
H  2.613847 1.375094 0.371283
C  0.444846 1.35477 0.500844
C  -0.742579 1.255922 -0.33448
H  0.516331 -1.202256 -1.489931
H  -1.83791 -1.141495 -1.247379
H  0.272287 0.945802 1.498316
H  -0.649083 1.615223 -1.364285
H  -2.859885 0.989736 -0.521043
H  0.579346 2.454862 0.606047
H  -0.314363 -1.429856 1.457796
totalener: -312.04647965 hartree
nucrepener: 379.24984499 hartree
electener: -691.29632465 hartree
oneelecener: -1159.57229680 hartree
twoeener: 468.27597216 hartree
kineticenergy: 310.15478418 hartree
exchangeener: -34.167341700129 hartree
correlationener: -1.960903624490 hartree
xcener: -36.128245324620 hartree
chargesum: 1.0000000
charge: -0.216626 0.189166 -0.218768 0.184113 -0.183022 -0.112002 -0.213235 0.157519 0.166991 -0.265289 0.160551 0.174693 -0.147432 0.067578 0.139801 0.180634 0.165852 0.208933 0.188699 0.209474 0.162370
charge: -0.180524 0.175191 -0.159249 0.159750 -0.157972 -0.145437 -0.226891 0.155543 0.158917 -0.200032 0.151098 0.157344 -0.207733 0.130269 0.156425 0.157822 0.166879 0.176962 0.165903 0.212659 0.153076
qa: -0.2166 0.1892 -0.2188 0.1841 -0.1830 -0.1120 -0.2132 0.1575 0.1670 -0.2653 0.1606 0.1747 -0.1474 0.0676 0.1398 0.1806 0.1659 0.2089 0.1887 0.2095 0.1624
va: 3.9078 0.9617 3.8886 0.9626 3.9350 3.9036 3.9244 0.9710 0.9711 3.9683 0.9663 0.9624 3.8852 3.6848 0.9673 0.9643 0.9804 0.9432 0.9659 0.9518 0.9650
dispcorr: -0.018853567 hartree
energy: -312.065333218416
dipole: 0.33360 -1.01553 -0.68193 1.97790 -0.64453 1.33337 0.19015 -0.31819 -0.12804
magnitude: 1.50310 au
magnitude: 3.82057 debye
