program: Gaussian 09
title: 000050882
version: EM64L-G09RevD.01
frameworkgroup: C1[X(C16H24N2O2)]
method: RPBEPBE
basis: SDD
operation: Freq
keyword: #p
keyword: freq=noraman
keyword: PBEPBE/SDD
title: #p freq=noraman PBEPBE/SDD
converged: YES YES NO NO
title: Mulliken charges:
elementType: O O N N C C C C C C C C C C C C C C C C H H H H H H H H H H H H H H H H H H H H H H H H
charge: -0.297060 -0.247312 -0.163081 -0.002873 -0.029697 0.022609 -0.403299 -0.400458 -0.434970 -0.337347 -0.743722 -0.766540 -0.447296 -0.251088 0.217614 0.208460 -0.260934 -0.414822 -0.182516 -0.318630 0.197962 0.181599 0.206765 0.189309 0.187709 0.201251 0.197580 0.214035 0.187169 0.230903 0.217111 0.219168 0.223075 0.209392 0.219097 0.232270 0.201735 0.218717 0.227836 0.255611 0.272302 0.281526 0.234789 0.246051
chargesum: 0.00000
title: Mulliken charges with hydrogens summed into heavy atoms:
elementType: O O N N C C C C C C C C C C C C C C C C
charge: -0.297060 -0.247312 -0.163081 -0.002873 0.168265 0.204208 -0.007224 -0.011498 -0.023355 0.080725 -0.084368 -0.105782 -0.026844 0.232360 0.217614 0.208460 0.011368 -0.133296 0.052273 -0.072579
polarizability: 2.29083485e+02 3.01172136e+01 1.64150303e+02 1.44728864e-01 -1.13467839e+01 1.72761409e+02
1716.lowfreq: -31.5951 -22.2389 -9.7214 -0.0008 -0.0006 -0.0005 6.6013 9.7999 17.7450
frequency: -21.5356 -17.4967 17.0120 33.0632 53.4294 72.0886 97.8508 131.0487 140.8735 156.7205 166.8067 201.8969 227.2923 240.2704 256.9236 272.6064 310.7469 324.6657 345.1160 365.6936 376.1640 384.5563 399.1425 420.1063 431.4152 465.3376 481.0999 500.1218 534.8705 607.0630 610.4768 669.5090 682.6383 696.7545 719.3993 770.6156 808.4163 813.0737 820.7785 829.1006 840.0852 867.5317 880.6973 903.3079 926.7502 943.1364 943.2627 967.2434 968.1069 990.7658 997.7783 999.2104 1013.1893 1022.8079 1029.7787 1057.9968 1068.0955 1076.0196 1087.6700 1093.1896 1116.3159 1120.8943 1138.0655 1151.8844 1159.1808 1196.0805 1198.8203 1211.2249 1215.7444 1242.1405 1251.8337 1270.3190 1280.5862 1296.9479 1311.7267 1313.5824 1324.4192 1326.6412 1340.3247 1344.9467 1350.3392 1353.5397 1355.2408 1367.2170 1372.8267 1380.9746 1385.9591 1411.4098 1446.6417 1452.9845 1454.1369 1459.0306 1460.0745 1463.2978 1468.6223 1472.9881 1481.4639 1483.8112 1491.8053 1551.0417 1582.5784 1620.1804 2839.0247 2876.1943 2972.0502 2975.8122 2977.7539 2980.2566 2981.4541 2992.8101 2997.9476 3017.1895 3029.3662 3036.8935 3044.8977 3048.3454 3070.3436 3073.7071 3079.2308 3080.1506 3087.3268 3089.0920 3134.7105 3151.8511 3158.9702 3179.7554
redmass: 3.7769 3.8608 4.8499 4.2078 6.2981 3.7446 4.9773 2.6416 2.5645 1.1486 3.6162 4.0161 1.2128 2.8272 3.2441 2.1469 2.7656 2.6228 2.6551 2.3751 2.8848 2.4967 2.8369 2.8513 4.7152 3.4654 3.2604 2.2182 2.8515 2.0966 7.4591 2.6186 7.3779 7.2242 1.8009 2.0206 3.7971 2.6018 2.4345 1.7348 1.4961 2.6105 2.2909 2.8228 1.7535 1.4840 1.4037 1.5953 1.5153 2.0107 3.5106 1.4034 1.6754 4.3912 1.5867 1.9702 2.9956 1.6869 2.5899 2.1054 1.6572 2.0457 1.9828 2.2136 2.4819 1.3788 1.3158 1.4805 1.3079 2.6536 1.6280 1.2576 1.1877 1.3274 10.7026 1.3866 1.2598 1.2378 1.4295 1.4350 1.3808 1.5386 1.4288 1.3636 1.2764 1.3187 1.2372 2.1881 1.0897 1.8423 1.1078 1.0853 1.1441 1.0828 1.0750 1.0597 1.0602 1.0627 1.0585 5.9719 5.9524 11.2382 1.0805 1.0719 1.0577 1.0612 1.0586 1.0375 1.0461 1.0663 1.0716 1.0594 1.0969 1.1026 1.0978 1.1033 1.0988 1.0980 1.0996 1.0990 1.0902 1.1051 1.0885 1.0925 1.0929 1.0989
irintensity: 0.1706 0.0313 2.9038 0.1103 0.0260 0.3002 0.0056 0.5066 0.6351 0.1761 0.2856 3.2585 0.7350 6.3851 10.0146 6.9113 3.1326 0.1663 0.3998 2.7526 0.2902 2.7859 11.6295 0.6198 3.0554 2.2675 1.2595 2.9079 2.4324 6.5213 1.2066 11.1137 2.4784 8.0798 59.3082 4.3883 1.9091 2.0563 0.1941 20.5347 0.1095 13.2756 6.6331 8.6335 4.8173 9.1657 1.2800 9.5976 2.4314 28.0093 69.8331 0.6172 7.7768 3.2114 1.7973 11.5899 176.3279 66.6910 15.6185 7.4645 47.4761 7.9557 6.4375 25.9411 19.1372 3.9821 7.0822 46.5396 4.6904 296.4794 37.5909 2.9289 2.1989 0.4753 5.8987 4.2481 4.1246 12.7225 4.6094 3.2091 1.5968 5.8934 4.5431 2.6277 17.6874 36.0639 4.1896 17.4050 5.7453 8.8046 4.3148 17.0335 7.2012 17.2911 7.5517 13.9032 9.7585 1.1405 16.3825 16.0359 32.5280 180.7964 72.4795 111.5818 20.6709 12.5675 33.1673 49.4173 35.4305 15.2006 63.0470 26.0686 50.7597 25.6258 21.4884 79.9314 37.0671 36.0229 25.9053 65.3917 30.4024 25.4741 10.0571 3.8128 16.2045 9.9897
temp: 298.150 k
press: 1.00000 atm
elementType: 8 8 7 7 6 6 6 6 6 6 6 6 6 6 6 6 6 6 6 6 1 1 1 1 1 1 1 1 1 1 1 1 1 1 1 1 1 1 1 1 1 1 1 1
symmnumber: 1
zpe: 984911.5 jmol-1
zpe.correction: 0.375133 hartree
zpe.thermalcorrener: 0.393558 hartree
zpe.thermalcorrenthalpy: 0.394502 hartree
zpe.thermalcorrgfe: 0.327712 hartree
zpe.sumelectzpe: -882.498043 hartree
zpe.sumelectthermal: -882.479618 hartree
zpe.sumelectthermalent: -882.478674 hartree
zpe.sumelectthermalfe: -882.545464 hartree
dipole: -3.2408 0.7034 -3.9748
dipole: 5.1766
quadrupole: -127.8266 -117.8834 -123.0370
quadrupole: 5.6205 -14.0735 0.3915
quadrupole: -4.9109 5.0323 -0.1214 5.6205 -14.0735 0.3915
hfenergy: -882.8731761 hartree
pointgroup: C01 [X(C16H24N2O2)]
dipole: -1.265412 -0.0644258 1.5944961 debye
polarizability: 229.601718|-29.347748|160.6908194|3.856689|-9.4989962|175.7026597 unknown
InChI: InChI=1S/C16H24N2O2/c1-13-6-3-7-14(2)18(13)10-5-11-20-16(19)15-8-4-9-17-12-15/h4,8-9,12-14H,3,5-7,10-11H2,1-2H3
charge 0 multiplicity 1
44 atoms
O  1.005422 1.271982 0.129672
O  1.861706 1.369701 -2.038299
N  -2.422549 0.05492 0.3882
N  5.333523 -0.727813 -0.729333
C  -3.735049 0.66564 -0.003972
C  -2.489061 -1.427271 0.60436
C  -4.245947 0.005853 -1.308533
C  -3.013319 -2.106201 -0.6888
C  -4.360219 -1.525859 -1.16566
C  -1.687515 0.836213 1.411121
C  -4.819091 0.653814 1.116351
C  -1.114456 -2.032434 0.966328
C  -1.131302 2.175438 0.864051
C  -0.218775 1.993585 -0.346128
C  1.973069 1.012128 -0.839551
C  3.139353 0.269326 -0.27584
C  3.213882 -0.133716 1.081492
C  4.222549 -0.051025 -1.137356
C  4.357338 -0.835258 1.517088
C  5.385294 -1.10876 0.583854
H  -3.527025 1.727599 -0.240238
H  -3.199893 -1.67771 1.434318
H  -3.528527 0.238184 -2.11967
H  -5.221639 0.4495 -1.586679
H  -3.106577 -3.194279 -0.504362
H  -2.249167 -1.965358 -1.479775
H  -5.159871 -1.785519 -0.443269
H  -4.651241 -1.979302 -2.13237
H  -2.300101 1.053325 2.320432
H  -0.824722 0.241128 1.747318
H  -4.458262 1.15284 2.034325
H  -5.719095 1.196995 0.7736
H  -5.128445 -0.370407 1.388426
H  -0.795961 -1.806202 1.999213
H  -1.168167 -3.132786 0.877375
H  -0.337595 -1.667923 0.268922
H  -1.953847 2.854581 0.567041
H  -0.57828 2.687578 1.675045
H  0.099901 2.953828 -0.789632
H  -0.702569 1.370851 -1.118553
H  2.392484 0.104576 1.762671
H  4.184893 0.251867 -2.189142
H  4.456376 -1.165744 2.555555
H  6.288476 -1.651687 0.885306
