program: Orca
programVersion: 5.0.3
elementType: C H C H C C C H H C H H C C H H H H H H H
charge: 1
multiplicity: 1
keywords: m062x cc-pVTZ EnGrad RIJCOSX verytightscf cc-pVTZ/C def2/J soscf
formula: C8H13
InChI: InChI=1/C8H13/c1-2-4-6-8-7-5-3-1/h1-2,7H,3-6,8H2
21 atoms
C  -1.994847 0.538912 0.118492
H  -2.170767 0.727541 1.181287
C  -1.927856 -0.988595 -0.173392
H  -2.672866 -1.571904 0.371364
C  -0.500787 -1.18354 0.294978
C  0.618491 -1.152679 -0.492777
C  1.911549 -0.662715 0.068908
H  2.023149 -0.95109 1.119536
H  2.773661 -1.042259 -0.486919
C  1.875506 0.899231 -0.049909
H  1.976302 1.181689 -1.104663
H  2.726816 1.33548 0.479628
C  0.545077 1.479598 0.498377
C  -0.576987 0.90604 -0.280009
H  0.533511 -1.308019 -1.568042
H  -2.028382 -1.189903 -1.24433
H  0.421084 1.322428 1.574341
H  -0.442187 0.976418 -1.362398
H  -2.743937 1.076158 -0.473474
H  0.557806 2.569716 0.323906
H  -0.354541 -1.138018 1.375722
totalener: -312.30741553 hartree
nucrepener: 384.06534741 hartree
electener: -696.37276294 hartree
oneelecener: -1168.75723852 hartree
twoeener: 472.38447559 hartree
kineticenergy: 310.02343077 hartree
xcener: -23.095267748861 hartree
chargesum: 1.0000000
charge: -0.262002 0.193064 -0.277410 0.189166 -0.092618 -0.075271 -0.312404 0.189673 0.190642 -0.269766 0.180738 0.191675 -0.305794 -0.028248 0.233374 0.187671 0.199304 0.238492 0.191827 0.220879 0.217009
charge: 0.090339 0.002106 0.094490 0.000322 0.118516 0.132547 0.076141 0.001741 0.007072 0.098080 -0.005125 0.000949 0.063571 0.272044 -0.002723 0.001131 0.002282 0.006907 0.005021 0.031515 0.003075
qa: -0.2620 0.1931 -0.2774 0.1892 -0.0926 -0.0753 -0.3124 0.1897 0.1906 -0.2698 0.1807 0.1917 -0.3058 -0.0282 0.2334 0.1877 0.1993 0.2385 0.1918 0.2209 0.2170
va: 3.7199 0.9600 3.7535 0.9599 3.6393 3.6140 3.7892 0.9576 0.9604 3.7218 0.9557 0.9519 3.7539 3.5007 0.9385 0.9634 0.9532 0.9397 0.9571 0.9460 0.9502
energy: -312.307415528766
dipole: 0.56195 -0.79559 -0.23364 1.86114 -1.50797 0.35317 0.17409 -0.31772 -0.14363
magnitude: 0.44716 au
magnitude: 1.13658 debye
