program: Orca
programVersion: 5.0.3
elementType: C H C H C C C H H C H H C C H H H H H H H
charge: 1
multiplicity: 1
keywords: PBE0 def2-TZVP EnGrad D3BJ RIJCOSX verytightscf def2/J soscf
formula: C8H13
InChI: InChI=1/C8H13/c1-2-4-6-8-7-5-3-1/h1-2,7H,3-6,8H2
21 atoms
C  -2.00118 0.75511 0.069179
H  -2.163172 0.81911 1.147818
C  -1.730073 -0.973257 -0.162881
H  -2.618976 -1.328141 0.36287
C  -0.412901 -1.387169 0.389835
C  0.683431 -1.272793 -0.38345
C  1.998516 -0.696317 0.062614
H  2.203862 -0.900836 1.118857
H  2.854354 -1.036047 -0.527094
C  1.787734 0.846095 -0.13587
H  1.823372 1.10961 -1.198734
H  2.591938 1.396736 0.359276
C  0.423757 1.27787 0.494742
C  -0.766865 1.294418 -0.364447
H  0.518349 -1.193878 -1.462709
H  -1.830568 -1.132495 -1.237054
H  0.208968 0.687276 1.389177
H  -0.659236 1.623987 -1.401574
H  -2.882936 0.997013 -0.522556
H  0.495739 2.323581 0.866332
H  -0.328891 -1.478056 1.472022
totalener: -312.03836645 hartree
nucrepener: 379.26048563 hartree
electener: -691.29885208 hartree
oneelecener: -1159.59332087 hartree
twoeener: 468.29446879 hartree
kineticenergy: 310.16993141 hartree
exchangeener: -34.166405255075 hartree
correlationener: -1.960752130878 hartree
xcener: -36.127157385953 hartree
chargesum: 1.0000000
charge: -0.251444 0.201976 -0.210470 0.196354 -0.206287 -0.080694 -0.222554 0.158774 0.166088 -0.268631 0.158697 0.172097 -0.164875 0.072971 0.136480 0.190905 0.162490 0.204767 0.196422 0.215423 0.171511
charge: -0.165254 0.175289 -0.119125 0.164743 -0.186582 -0.120526 -0.225475 0.154920 0.154719 -0.208445 0.149487 0.157422 -0.211136 0.092946 0.156436 0.158171 0.173563 0.174221 0.163276 0.208279 0.153072
qa: -0.2514 0.2020 -0.2105 0.1964 -0.2063 -0.0807 -0.2226 0.1588 0.1661 -0.2686 0.1587 0.1721 -0.1649 0.0730 0.1365 0.1909 0.1625 0.2048 0.1964 0.2154 0.1715
va: 3.9239 0.9565 3.8742 0.9560 3.9172 3.9008 3.9166 0.9704 0.9728 3.9732 0.9678 0.9649 3.8605 3.7017 0.9678 0.9584 0.9918 0.9499 0.9640 0.9482 0.9630
dispcorr: -0.018933073 hartree
energy: -312.057299521621
dipole: 0.19927 -1.04584 -0.84657 1.76794 -0.61444 1.15349 0.34331 -0.46652 -0.12322
magnitude: 1.43611 au
magnitude: 3.65030 debye
