program: Orca
programVersion: 5.0.3
elementType: C H C H C C C H H C H H C C H H H H H H H
charge: 1
multiplicity: 1
keywords: PBE0 cc-pVTZ EnGrad D3BJ RIJCOSX verytightscf cc-pVTZ/C def2/J soscf
formula: C8H13
InChI: InChI=1/C8H13/c1-2-4-6-8-7-5-3-1/h1-2,7H,3-6,8H2
21 atoms
C  -1.990054 0.575349 0.095461
H  -2.166869 0.75438 1.161619
C  -1.848632 -0.965627 -0.173966
H  -2.656941 -1.508096 0.324161
C  -0.45304 -1.285713 0.340046
C  0.642879 -1.223973 -0.451261
C  1.935482 -0.690686 0.072676
H  2.089711 -0.945078 1.126489
H  2.804098 -1.036618 -0.497383
C  1.83277 0.860538 -0.091529
H  1.883283 1.122486 -1.154874
H  2.673758 1.356827 0.401119
C  0.498557 1.438219 0.511517
C  -0.662231 1.121962 -0.315809
H  0.527869 -1.283846 -1.534836
H  -1.913412 -1.162243 -1.24905
H  0.355978 1.150183 1.556143
H  -0.554564 1.365128 -1.377673
H  -2.806075 1.008187 -0.493693
H  0.620811 2.539222 0.470826
H  -0.324589 -1.298607 1.423709
totalener: -312.05622181 hartree
nucrepener: 380.83062966 hartree
electener: -692.88685147 hartree
oneelecener: -1162.64834272 hartree
twoeener: 469.76149126 hartree
kineticenergy: 309.63448461 hartree
exchangeener: -34.152603342925 hartree
correlationener: -1.963312434534 hartree
xcener: -36.115915777458 hartree
chargesum: 1.0000000
charge: -0.160725 0.154347 -0.168901 0.152677 -0.108094 -0.127256 -0.172603 0.140876 0.154030 -0.196679 0.138455 0.153982 -0.171715 0.033159 0.173454 0.144695 0.149672 0.203252 0.160889 0.184169 0.162318
charge: 0.089453 0.007905 0.091942 0.000334 0.098822 0.076758 0.072113 0.000126 0.007341 0.109482 -0.005929 0.000670 0.070831 0.329564 -0.011876 0.001411 0.004850 0.014074 0.010034 0.042712 -0.010616
qa: -0.1607 0.1543 -0.1689 0.1527 -0.1081 -0.1273 -0.1726 0.1409 0.1540 -0.1967 0.1385 0.1540 -0.1717 0.0332 0.1735 0.1447 0.1497 0.2033 0.1609 0.1842 0.1623
va: 3.8358 0.9905 3.8812 0.9867 3.8242 3.8329 3.8863 0.9939 0.9878 3.8656 0.9903 0.9852 3.8853 3.5946 0.9855 0.9938 0.9937 0.9730 0.9868 0.9783 0.9935
dispcorr: -0.018897233 hartree
energy: -312.075119039718
dipole: 0.49948 -0.87088 -0.37140 1.93027 -1.03467 0.89560 0.14651 -0.26895 -0.12244
magnitude: 0.97726 au
magnitude: 2.48400 debye
