program: Orca
programVersion: 5.0.3
elementType: C H C H C C C H H C H H C C H H H H H H H
charge: 1
multiplicity: 1
keywords: PBE0 cc-pVTZ EnGrad D3BJ RIJCOSX verytightscf cc-pVTZ/C def2/J soscf
formula: C8H13
InChI: InChI=1/C8H13/c1-2-4-6-8-7-5-3-1/h1-2,7H,3-6,8H2
21 atoms
C  -1.992303 0.548591 0.113374
H  -2.167837 0.734616 1.17706
C  -1.901636 -0.981158 -0.174652
H  -2.669054 -1.552504 0.35264
C  -0.484799 -1.221513 0.309166
C  0.625943 -1.178411 -0.480611
C  1.917161 -0.672312 0.071091
H  2.041494 -0.949415 1.123304
H  2.783432 -1.040097 -0.486998
C  1.859431 0.886214 -0.063535
H  1.940037 1.160633 -1.122191
H  2.710642 1.342622 0.449289
C  0.53169 1.471895 0.505114
C  -0.604464 0.981607 -0.294184
H  0.532996 -1.308067 -1.558916
H  -1.988962 -1.178991 -1.247648
H  0.401096 1.275965 1.573473
H  -0.470826 1.087683 -1.374388
H  -2.766648 1.05289 -0.47596
H  0.585892 2.568302 0.372129
H  -0.343072 -1.189409 1.391098
totalener: -312.06893781 hartree
nucrepener: 382.83622666 hartree
electener: -694.90516447 hartree
oneelecener: -1166.60050273 hartree
twoeener: 471.69533826 hartree
kineticenergy: 309.63988107 hartree
exchangeener: -34.158814507127 hartree
correlationener: -1.967594304738 hartree
xcener: -36.126408811865 hartree
chargesum: 1.0000000
charge: -0.160596 0.148560 -0.165316 0.153848 -0.077762 -0.102983 -0.177863 0.140627 0.155078 -0.199118 0.138057 0.153662 -0.166662 -0.014009 0.187716 0.143257 0.146953 0.193460 0.157596 0.178775 0.166719
charge: 0.087951 0.003106 0.091648 0.000068 0.118301 0.113180 0.074992 0.001146 0.007372 0.101373 -0.004943 0.000675 0.066339 0.290908 -0.006405 0.001444 0.003088 0.008033 0.007287 0.035691 -0.001256
qa: -0.1606 0.1486 -0.1653 0.1538 -0.0778 -0.1030 -0.1779 0.1406 0.1551 -0.1991 0.1381 0.1537 -0.1667 -0.0140 0.1877 0.1433 0.1470 0.1935 0.1576 0.1788 0.1667
va: 3.8462 0.9930 3.8724 0.9876 3.8136 3.8183 3.8942 0.9937 0.9879 3.8711 0.9898 0.9852 3.8796 3.6639 0.9802 0.9955 0.9924 0.9787 0.9864 0.9787 0.9924
dispcorr: -0.018890079 hartree
energy: -312.087827888311
dipole: 0.55213 -0.81745 -0.26531 1.87614 -1.36842 0.50772 0.16184 -0.28888 -0.12704
magnitude: 0.58678 au
magnitude: 1.49149 debye
