program: Orca
programVersion: 5.0.3
elementType: C H C H C C C H H C H H C C H H H H H H H
charge: 1
multiplicity: 1
keywords: m062x cc-pVTZ EnGrad RIJCOSX verytightscf cc-pVTZ/C def2/J soscf
formula: C8H13
InChI: InChI=1/C8H12.H/c1-2-4-6-8-7-5-3-1;/h1-2,7-8H,3-6H2;
21 atoms
C  -1.974591 0.653054 0.124605
H  -2.125945 0.844365 1.191599
C  -1.851069 -0.94855 -0.118673
H  -2.653133 -1.441302 0.433794
C  -0.470074 -1.347941 0.372965
C  0.672691 -1.257558 -0.385085
C  1.974977 -0.654646 0.112828
H  2.129471 -0.855329 1.177619
H  2.844701 -1.012349 -0.441046
C  1.850558 0.950097 -0.115734
H  1.972913 1.172993 -1.18021
H  2.654525 1.437142 0.438956
C  0.471387 1.345627 0.38321
C  -0.67353 1.261386 -0.371484
H  0.550108 -1.263894 -1.471293
H  -1.976383 -1.162279 -1.18474
H  -0.00064 0.000508 -0.004139
H  -0.554479 1.279187 -1.458236
H  -2.845826 1.016739 -0.423184
H  0.350187 1.326719 1.471492
H  -0.346562 -1.345418 1.45838
totalener: -312.25077063 hartree
nucrepener: 382.93506206 hartree
electener: -695.18583269 hartree
oneelecener: -1166.08604266 hartree
twoeener: 470.90020998 hartree
kineticenergy: 309.99025864 hartree
xcener: -23.097442547032 hartree
chargesum: 1.0000000
charge: -0.304007 0.193484 -0.303297 0.196677 -0.069413 -0.068552 -0.304243 0.193575 0.196230 -0.303502 0.193438 0.196835 -0.068087 -0.068417 0.209876 0.193483 0.091179 0.209653 0.196141 0.208831 0.210116
charge: 0.109422 -0.002148 0.109475 0.002936 0.137811 0.137395 0.109635 -0.002175 0.002773 0.109474 -0.002243 0.002891 0.136872 0.137041 0.004326 -0.002158 -0.007925 0.004457 0.002832 0.005393 0.003916
qa: -0.3040 0.1935 -0.3033 0.1967 -0.0694 -0.0686 -0.3042 0.1936 0.1962 -0.3035 0.1934 0.1968 -0.0681 -0.0684 0.2099 0.1935 0.0912 0.2097 0.1961 0.2088 0.2101
va: 3.7576 0.9566 3.7554 0.9547 3.6374 3.6373 3.7577 0.9566 0.9553 3.7554 0.9571 0.9547 3.6377 3.6375 0.9541 0.9570 1.1319 0.9541 0.9553 0.9545 0.9539
energy: -312.250770625497
dipole: -0.00135 0.00180 0.00045 -0.00438 0.00336 -0.00102 0.00389 -0.00407 -0.00018
magnitude: 0.00112 au
magnitude: 0.00286 debye
