program: Orca
programVersion: 5.0.3
elementType: C H C H C C C H H C H H C C H H H H H H H
charge: 1
multiplicity: 1
keywords: PBE0 cc-pVTZ EnGrad D3BJ RIJCOSX verytightscf cc-pVTZ/C def2/J soscf
formula: C8H13
InChI: InChI=1/C8H13/c1-2-4-6-8-7-5-3-1/h1-2,7H,3-6,8H2
21 atoms
C  -1.998339 0.75978 0.070474
H  -2.163256 0.83412 1.148088
C  -1.730615 -0.964666 -0.157114
H  -2.618364 -1.316722 0.372606
C  -0.417467 -1.386087 0.393727
C  0.686796 -1.277231 -0.3763
C  2.00195 -0.691041 0.063101
H  2.210618 -0.887294 1.120398
H  2.856141 -1.033635 -0.526784
C  1.78975 0.860914 -0.141242
H  1.833106 1.120234 -1.204673
H  2.593797 1.408585 0.357239
C  0.421775 1.258921 0.486987
C  -0.767682 1.302657 -0.375002
H  0.522481 -1.203581 -1.456049
H  -1.835038 -1.1258 -1.230465
H  0.183853 0.556153 1.29238
H  -0.658541 1.577396 -1.4278
H  -2.881971 0.990226 -0.523044
H  0.461553 2.225289 1.030304
H  -0.336615 -1.489372 1.475453
totalener: -312.02929885 hartree
nucrepener: 379.55822723 hartree
electener: -691.58752608 hartree
oneelecener: -1160.12934276 hartree
twoeener: 468.54181668 hartree
kineticenergy: 309.64565770 hartree
exchangeener: -34.146291260837 hartree
correlationener: -1.961058360513 hartree
xcener: -36.107349621349 hartree
chargesum: 1.0000000
charge: -0.204521 0.176123 -0.182521 0.174244 -0.143502 -0.095971 -0.172374 0.133408 0.146490 -0.199750 0.136862 0.150545 -0.204067 0.111063 0.140154 0.168356 0.142303 0.199509 0.178825 0.189865 0.154958
charge: 0.130980 0.014270 0.172433 0.008433 0.018160 0.074210 0.075273 -0.003313 -0.002567 0.105720 -0.010964 -0.000195 0.077398 0.299373 -0.015111 -0.000195 0.009666 0.015777 0.006618 0.044983 -0.020948
qa: -0.2045 0.1761 -0.1825 0.1742 -0.1435 -0.0960 -0.1724 0.1334 0.1465 -0.1998 0.1369 0.1505 -0.2041 0.1111 0.1402 0.1684 0.1423 0.1995 0.1788 0.1899 0.1550
va: 3.8603 0.9814 3.8841 0.9776 3.8180 3.8297 3.8849 0.9951 0.9883 3.8705 0.9933 0.9865 3.8795 3.5735 0.9941 0.9825 1.0135 0.9761 0.9827 0.9770 0.9955
dispcorr: -0.018986918 hartree
energy: -312.048285767295
dipole: 0.15706 -1.01117 -0.85411 1.55031 -0.47615 1.07416 0.40052 -0.50671 -0.10620
magnitude: 1.37644 au
magnitude: 3.49864 debye
