program: Gaussian 09
title: 000050826
version: EM64L-G09RevD.01
frameworkgroup: C1[X(C18H22N2O2)]
method: RPBEPBE
basis: SDD
operation: Freq
keyword: #p
keyword: freq=noraman
keyword: PBEPBE/SDD
title: #p freq=noraman PBEPBE/SDD
converged: YES YES NO NO
title: Mulliken charges:
elementType: O O N N C C C C C C C C C C C C C C C C C C H H H H H H H H H H H H H H H H H H H H H H
charge: -0.304529 -0.279842 -0.108851 -0.687040 -0.335444 -0.441439 -0.491833 -0.249863 0.447356 -0.629046 -0.349888 -0.451608 -0.215274 -0.223768 0.203035 -0.255645 0.246072 -0.354311 -0.329100 0.499445 -0.407142 -0.400404 0.182025 0.250863 0.218107 0.196625 0.189932 0.220946 0.250248 0.215574 0.225999 0.187872 0.225828 0.259834 0.229307 0.235755 0.220054 0.224592 0.266460 0.262601 0.219779 0.217713 0.309451 0.309553
chargesum: 0.00000
title: Mulliken charges with hydrogens summed into heavy atoms:
elementType: O O N N C C C C C C C C C C C C C C C C C C
charge: -0.304529 -0.279842 -0.108851 -0.068035 0.097444 -0.026707 -0.080955 0.215959 0.447356 0.010653 -0.090054 -0.222301 0.020482 -0.003714 0.203035 -0.031053 0.246072 -0.087851 -0.066499 0.499445 -0.187363 -0.182691
polarizability: 2.82913438e+02 5.33746425e+01 1.81493676e+02 4.99987491e+00 -2.11214040e+01 1.79220008e+02
1716.lowfreq: -8.0814 -6.9870 -0.0007 -0.0005 0.0001 7.4569 8.7323 16.8218 21.0999
frequency: 6.9870 15.7188 21.0734 37.7195 59.2142 62.2608 78.8428 96.3105 108.5170 129.0687 176.9225 183.4427 212.2553 230.2860 264.2929 292.5729 300.7985 312.2669 324.3621 338.0124 363.8055 380.1524 400.7647 405.2873 408.2418 413.9904 418.9924 467.0780 487.4504 506.1512 544.5193 604.8636 608.0287 616.8805 634.1910 676.4507 705.0568 727.6565 753.8639 757.3930 783.5399 812.5866 821.9349 822.5133 829.5839 842.1861 861.3494 878.0742 909.5945 919.7875 969.8478 975.1936 982.8649 983.2397 989.4574 995.6121 998.1463 1009.2321 1016.3940 1021.9975 1031.9450 1054.4127 1071.0845 1081.4929 1103.7892 1113.6946 1129.1852 1136.1117 1169.9482 1178.2074 1180.0304 1190.3861 1202.7196 1212.9350 1252.2080 1254.3364 1263.0281 1291.2900 1306.8786 1315.8928 1323.4721 1351.4468 1355.3171 1363.4060 1376.2528 1388.2033 1391.4680 1429.1776 1440.4228 1446.2821 1453.1919 1465.6134 1469.4166 1471.1024 1475.8176 1481.1811 1484.2790 1516.8388 1570.2919 1594.1260 1607.7904 1614.9571 1631.2400 1645.0715 2836.1442 2843.8679 2858.8848 2986.9609 2991.6055 3010.8081 3026.9587 3038.1081 3054.4355 3083.1651 3087.4199 3109.0177 3121.8624 3125.0388 3125.3614 3137.5982 3149.3039 3156.2043 3163.5175 3174.0125 3561.3111 3701.3327
redmass: 5.1249 4.4329 4.7329 4.7752 5.2134 4.1590 3.4824 6.3597 3.5667 4.0874 2.6302 2.8351 1.6283 2.8030 3.8235 4.5950 2.6148 3.3868 3.0696 2.7260 3.4862 2.2360 1.2503 1.0557 2.8423 2.6919 2.3624 3.3085 3.5410 2.8162 2.9973 5.7746 5.2154 6.3426 6.8841 3.9646 2.3243 1.8258 4.3542 1.7701 5.3707 3.4015 2.9746 1.4193 4.0717 1.8461 1.2472 2.3280 2.3382 1.4805 1.3739 2.0049 1.3741 1.3502 5.0612 1.8913 2.7680 1.4060 1.4796 2.2938 2.1084 2.9846 2.0801 1.5643 2.1480 1.4595 1.2155 2.1797 1.0579 1.1464 1.1146 1.5212 1.1888 2.3956 2.4183 1.4648 1.7359 1.2617 1.3200 1.3519 2.9141 1.3839 1.5781 1.5830 1.5132 3.8286 4.8466 1.2136 1.9831 4.2175 1.0830 1.1272 1.0842 1.0766 1.0848 1.5041 1.3383 3.1951 7.4041 6.1376 9.5573 6.3371 3.1284 1.4595 1.0708 1.0677 1.0617 1.0857 1.0611 1.0615 1.0721 1.0921 1.0948 1.1000 1.1035 1.0869 1.0892 1.0895 1.0870 1.0912 1.0953 1.0953 1.1007 1.0948 1.0450 1.1040
irintensity: 1.6630 0.1808 0.1642 0.6821 2.3867 0.8640 1.1469 0.6944 0.5525 1.6339 1.1947 2.7587 2.1311 0.4028 6.8280 12.1599 5.2680 2.8254 4.1311 3.1083 7.8200 4.2021 301.9025 4.4367 0.1112 0.0222 6.3079 5.6421 6.6266 3.4619 1.0390 12.0602 1.8568 0.3418 1.7699 38.7278 26.4003 55.2186 11.6149 49.3554 3.9221 5.8052 1.9433 0.9738 3.0375 68.3775 1.3199 6.0757 27.8408 10.2104 0.0520 13.4614 1.6599 0.4631 1.1930 7.6344 25.8624 3.4831 11.0049 19.6933 19.9403 182.5972 114.3649 12.9297 52.6201 7.0094 13.3812 5.1657 2.7149 157.7247 1.7296 7.0939 10.9780 5.5741 245.1055 15.8262 62.9541 5.7564 2.2394 6.8799 103.2634 20.7426 4.9622 4.1532 7.3092 4.3432 11.1044 5.4700 11.3436 5.5714 7.7012 16.9211 6.0754 9.3657 25.9424 14.0875 7.5563 71.0015 32.9599 0.5404 286.9524 14.4870 83.6533 323.5992 40.4815 50.6958 284.2789 26.3741 25.6161 54.3255 37.3651 9.4138 46.9702 42.0515 16.1360 8.9723 15.4951 22.6070 4.4328 21.6731 28.5683 8.7977 16.8081 3.6203 105.2017 22.2555
temp: 298.150 k
press: 1.00000 atm
elementType: 8 8 7 7 6 6 6 6 6 6 6 6 6 6 6 6 6 6 6 6 6 6 1 1 1 1 1 1 1 1 1 1 1 1 1 1 1 1 1 1 1 1 1 1
symmnumber: 1
zpe: 955719.0 jmol-1
zpe.correction: 0.364014 hartree
zpe.thermalcorrener: 0.385479 hartree
zpe.thermalcorrenthalpy: 0.386423 hartree
zpe.thermalcorrgfe: 0.309741 hartree
zpe.sumelectzpe: -957.443976 hartree
zpe.sumelectthermal: -957.422511 hartree
zpe.sumelectthermalent: -957.421567 hartree
zpe.sumelectthermalfe: -957.498249 hartree
dipole: 2.1766 1.5807 -3.3805
dipole: 4.3202
quadrupole: -87.0958 -131.7355 -129.5265
quadrupole: 13.9025 -1.5782 0.4394
quadrupole: 29.0234 -15.6162 -13.4072 13.9025 -1.5782 0.4394
hfenergy: -957.8079902 hartree
pointgroup: C01 [X(C18H22N2O2)]
dipole: 0.9095074 -0.4319379 1.3693591 debye
polarizability: 291.9567784|-43.0939027|169.0919918|0.513123|-20.7279605|182.5783515 unknown
InChI: InChI=1S/C18H22N2O2/c1-20(14-15-6-3-2-4-7-15)12-5-13-22-18(21)16-8-10-17(19)11-9-16/h2-4,6-11H,5,12-14,19H2,1H3
charge 0 multiplicity 1
44 atoms
O  -0.341345 1.987613 0.173728
O  0.263626 1.88507 -2.080334
N  -3.588106 0.077083 0.046181
N  5.720706 -0.000745 0.922467
C  -2.934477 0.743978 1.20033
C  -2.630573 2.237976 0.950226
C  -3.519177 -1.404564 0.131826
C  -1.691778 2.468561 -0.234653
C  -2.105293 -1.963524 0.003411
C  -4.97141 0.540177 -0.187068
C  -1.2090 -1.453635 -0.970092
C  -1.683811 -3.039282 0.823304
C  0.081152 -2.007485 -1.11814
C  -0.395245 -3.602682 0.671505
C  0.567749 1.736357 -0.865685
C  0.491904 -3.08719 -0.300758
C  1.887111 1.292898 -0.363169
C  2.921629 1.042595 -1.305303
C  2.159888 1.101989 1.018298
C  4.46438 0.422988 0.500653
C  4.190209 0.615886 -0.888189
C  3.42492 0.673732 1.447614
H  -3.556999 0.649499 2.127933
H  -1.979806 0.222668 1.39204
H  -2.180504 2.666883 1.866018
H  -3.565105 2.802483 0.764049
H  -3.979624 -1.789759 1.078702
H  -4.138487 -1.800658 -0.69849
H  -2.020931 1.907468 -1.125589
H  -1.604112 3.540613 -0.491943
H  -5.378385 0.047989 -1.088426
H  -5.659969 0.321927 0.669254
H  -4.990086 1.628738 -0.365306
H  -1.526691 -0.612245 -1.595704
H  -2.366547 -3.436905 1.585451
H  0.766216 -1.593124 -1.866325
H  -0.083844 -4.43506 1.313449
H  1.494539 -3.514608 -0.415698
H  2.70369 1.19442 -2.368024
H  1.364738 1.289456 1.745226
H  4.97911 0.430005 -1.627264
H  3.62114 0.527277 2.516838
H  5.921285 -0.136603 1.909163
H  6.463915 -0.176661 0.252396
