program: Orca
programVersion: 5.0.3
elementType: C H C H C C C H H C H H C C H H H H H H H
charge: 1
multiplicity: 1
keywords: PBE0 def2-TZVP EnGrad RIJCOSX verytightscf def2/J soscf
formula: C8H13
InChI: InChI=1/C8H13/c1-2-4-6-8-7-5-3-1/h1-2,7H,3-6,8H2
21 atoms
C  -1.998208 0.640503 0.077504
H  -2.175889 0.786747 1.149176
C  -1.786587 -0.952333 -0.171731
H  -2.637684 -1.437839 0.31488
C  -0.419777 -1.34399 0.368621
C  0.664809 -1.25847 -0.417734
C  1.967172 -0.706117 0.07008
H  2.152652 -0.939316 1.123621
H  2.832717 -1.034488 -0.515241
C  1.808628 0.836966 -0.11494
H  1.844176 1.095619 -1.179151
H  2.626947 1.371834 0.374888
C  0.455602 1.376048 0.503808
C  -0.725523 1.232788 -0.330139
H  0.519456 -1.220891 -1.500852
H  -1.848511 -1.142651 -1.247249
H  0.292002 0.993749 1.513419
H  -0.636363 1.58778 -1.361936
H  -2.84765 0.988568 -0.515952
H  0.600483 2.476781 0.569029
H  -0.313204 -1.408286 1.451876
totalener: -312.04945561 hartree
nucrepener: 379.53203776 hartree
electener: -691.58149337 hartree
oneelecener: -1160.12844354 hartree
twoeener: 468.54695016 hartree
kineticenergy: 310.15391666 hartree
exchangeener: -34.168161367519 hartree
correlationener: -1.961469651603 hartree
xcener: -36.129631019122 hartree
chargesum: 1.0000000
charge: -0.203126 0.183210 -0.219405 0.179463 -0.171432 -0.116988 -0.213751 0.158894 0.168679 -0.261166 0.160716 0.175434 -0.143475 0.053728 0.145927 0.175189 0.164698 0.208129 0.184967 0.207639 0.162672
charge: -0.190084 0.173786 -0.178539 0.157952 -0.138028 -0.144179 -0.225887 0.156047 0.160984 -0.197916 0.151465 0.157201 -0.211292 0.139197 0.157570 0.158206 0.165936 0.176369 0.166485 0.210565 0.154161
qa: -0.2031 0.1832 -0.2194 0.1795 -0.1714 -0.1170 -0.2138 0.1589 0.1687 -0.2612 0.1607 0.1754 -0.1435 0.0537 0.1459 0.1752 0.1647 0.2081 0.1850 0.2076 0.1627
va: 3.9010 0.9638 3.8941 0.9652 3.9395 3.9040 3.9295 0.9706 0.9706 3.9613 0.9665 0.9621 3.8868 3.6902 0.9665 0.9672 0.9794 0.9428 0.9667 0.9528 0.9643
energy: -312.049455609464
dipole: 0.38323 -0.95878 -0.57554 1.98252 -0.70355 1.27896 0.16522 -0.28967 -0.12445
magnitude: 1.40801 au
magnitude: 3.57887 debye
